program: Gaussian 09
title: 000147656
version: EM64L-G09RevD.01
frameworkgroup: C1[X(C20H26N4O2)]
method: RPBEPBE
basis: SDD
operation: Freq
keyword: #p
keyword: freq=noraman
keyword: PBEPBE/SDD
title: #p freq=noraman PBEPBE/SDD
converged: YES YES NO NO
title: Mulliken charges:
elementType: O O N N N N C C C C C C C C C C C C C C C C C C C C H H H H H H H H H H H H H H H H H H H H H H H H H H
charge: -0.277225 -0.276441 -0.657182 -0.655726 -0.369249 -0.368128 -0.386837 -0.387455 -0.419802 -0.420287 -0.299843 -0.300017 0.390567 0.391178 -0.525623 -0.524094 -0.356704 -0.359142 0.376000 0.375806 -0.226533 -0.226745 -0.398073 -0.404520 0.065175 0.063674 0.217241 0.204288 0.204463 0.219023 0.188001 0.222719 0.188622 0.221244 0.214209 0.213729 0.215254 0.211389 0.297933 0.297029 0.253385 0.252473 0.222702 0.221149 0.219374 0.224161 0.316229 0.310229 0.316403 0.310955 0.207132 0.207890
chargesum: 0.00000
title: Mulliken charges with hydrogens summed into heavy atoms:
elementType: O O N N N N C C C C C C C C C C C C C C C C C C C C
charge: -0.277225 -0.276441 -0.030724 -0.028367 -0.162117 -0.160238 0.034692 0.036031 -0.009082 -0.010421 0.128094 0.126625 0.390567 0.391178 -0.227690 -0.227065 -0.103318 -0.106669 0.376000 0.375806 -0.003831 -0.005596 -0.178699 -0.180360 0.065175 0.063674
polarizability: 2.04371270e+02 1.16241126e+01 3.12739087e+02 -5.59365281e+01 4.02092030e+00 2.39418542e+02
1716.lowfreq: -8.5254 -6.1187 0.0007 0.0007 0.0007 2.9225 5.1453 7.9836 9.9431
frequency: -1.6872 6.9300 9.3870 25.7693 32.2389 43.4810 57.7895 65.7450 83.7566 96.4028 109.7435 149.3608 158.1566 171.4531 186.5885 205.8714 218.3981 226.7231 234.7292 238.8720 241.2362 302.8932 332.9341 337.3867 383.3731 396.8753 398.0311 414.1245 419.6917 426.0471 431.3423 434.9025 446.5708 449.6973 491.0841 494.6848 502.1212 551.8862 552.8662 563.2245 565.1676 598.8169 599.1396 675.5077 676.3549 703.4132 705.7632 712.5429 714.0160 733.9895 786.5747 787.4048 792.2433 794.8097 816.1616 817.8441 847.2098 871.5291 878.6354 880.5016 895.0231 928.5003 931.2945 937.0310 961.5603 963.2109 964.8366 970.7673 983.0154 984.4361 1004.3166 1006.9166 1041.6598 1042.6600 1073.2905 1073.8670 1081.7292 1091.8303 1099.0942 1100.4522 1102.1519 1115.9194 1116.5315 1121.4247 1164.8863 1184.0496 1185.0402 1186.6153 1209.3011 1222.0242 1227.4980 1239.3166 1283.5822 1285.9775 1288.9997 1295.7715 1313.4474 1350.7638 1354.5973 1357.7735 1365.1436 1366.6491 1370.4939 1371.8941 1396.1446 1396.6762 1445.0495 1446.5534 1451.4907 1453.0452 1468.3350 1473.9877 1474.7578 1476.0810 1483.9532 1486.3319 1575.8073 1576.1948 1600.9697 1601.5006 1620.4340 1621.1594 1633.3767 1633.9024 2954.4866 2954.9645 2976.5598 2980.4341 2984.8713 2987.0880 3014.5177 3015.1270 3025.0350 3048.5706 3049.9828 3050.3044 3125.9950 3126.9431 3147.1819 3148.0591 3170.5001 3170.8266 3176.3425 3176.5789 3317.6418 3317.8486 3532.3797 3534.4312 3678.7683 3680.7720
redmass: 5.1122 5.6988 5.4464 5.4485 4.8568 5.5115 4.7224 5.3813 4.1571 4.2512 3.3206 3.7183 3.7565 3.4118 2.6030 2.6500 4.0964 3.8189 3.6680 4.3605 3.6535 2.1149 3.8227 3.1010 2.3914 3.8635 3.7866 2.5482 2.2341 2.0852 1.2359 1.3169 1.3803 1.3638 2.9305 3.2516 2.8435 3.1963 3.1036 3.8933 4.0919 4.8667 4.7488 3.1431 3.1106 3.5772 3.9107 2.3801 2.6356 1.3844 1.7359 1.6909 2.0888 2.2715 1.3192 1.3129 3.7462 1.8179 1.4650 1.6435 2.5626 1.5476 1.5178 2.5942 2.1282 1.6079 1.4437 1.6973 4.7626 4.6664 2.6131 1.7265 1.5674 1.5802 1.7603 1.7628 1.9432 1.6848 1.9085 1.7959 1.9761 1.6109 1.5888 2.2563 1.3278 1.1383 1.1394 1.1171 1.1477 3.3488 3.6548 1.2911 1.2586 1.3395 1.2847 1.2127 1.1873 1.4627 1.3831 1.5794 2.6909 2.9687 1.6103 1.5810 5.3111 5.1219 2.7850 2.5686 1.1341 1.0977 1.1157 2.1025 2.6839 1.3154 1.1020 1.1114 5.5617 5.5041 2.7082 2.7343 6.0134 5.9152 1.5919 1.5916 1.0552 1.0553 1.0605 1.0625 1.0643 1.0644 1.1058 1.1061 1.0966 1.0997 1.1031 1.1000 1.0862 1.0863 1.0935 1.0932 1.0957 1.0961 1.0923 1.0922 1.0760 1.0760 1.0450 1.0449 1.1035 1.1036
irintensity: 0.9005 0.6417 0.7047 5.5813 0.7175 0.6744 17.0991 0.3734 3.9678 3.4723 0.4577 1.7704 6.2005 2.3882 1.8979 3.1949 3.8814 2.8591 0.8834 1.3038 1.9314 0.6991 3.6444 0.1038 8.0884 25.7857 0.7928 2.7398 60.2640 0.6982 342.6992 69.5570 26.3297 57.0972 2.4991 6.7672 3.7913 5.7957 8.9558 19.6861 13.6378 3.8376 2.8543 11.4102 13.3452 23.5486 3.8124 46.6114 8.3563 8.9767 44.0658 10.0252 6.5601 2.0630 137.2674 70.7329 5.5499 1.3826 0.0484 2.8094 0.5768 46.8720 34.2782 60.7775 33.6158 9.1092 6.0249 15.3469 0.1535 1.3523 120.3172 34.9771 19.3872 13.5587 93.6074 47.5507 34.2139 0.7000 4.1658 7.7315 2.4370 35.2548 29.6861 20.8605 4.8531 6.7561 2.5310 7.2226 0.1520 67.8874 264.0138 8.1607 34.6745 4.2783 6.8722 0.5347 1.0100 7.6530 36.7762 0.9937 19.5760 266.8030 1.9005 1.2786 5.7527 5.4179 25.9423 290.3443 0.1104 12.7265 1.2330 12.5880 9.1357 0.1110 6.1716 13.4983 66.8641 102.9398 126.2688 94.4383 16.1490 139.2433 49.7140 187.1766 6.4075 44.5170 0.6328 66.9560 4.2360 46.8789 83.5874 2.8785 29.2330 11.1108 100.6961 86.3865 5.2918 5.4690 21.3006 27.0983 6.9025 12.1706 5.4837 5.4585 29.9745 36.5493 16.5323 14.4598 17.7853 18.5483
temp: 298.150 k
press: 1.00000 atm
elementType: 8 8 7 7 7 7 6 6 6 6 6 6 6 6 6 6 6 6 6 6 6 6 6 6 6 6 1 1 1 1 1 1 1 1 1 1 1 1 1 1 1 1 1 1 1 1 1 1 1 1 1 1
symmnumber: 1
zpe: 1128839.9 jmol-1
zpe.correction: 0.429952 hartree
zpe.thermalcorrener: 0.455165 hartree
zpe.thermalcorrenthalpy: 0.456109 hartree
zpe.thermalcorrgfe: 0.371005 hartree
zpe.sumelectzpe: -1145.224632 hartree
zpe.sumelectthermal: -1145.199420 hartree
zpe.sumelectthermalent: -1145.198476 hartree
zpe.sumelectthermalfe: -1145.283579 hartree
dipole: -2.8976 -3.9440 -1.4818
dipole: 5.1134
quadrupole: -162.0532 -110.1571 -144.4085
quadrupole: 5.9074 0.4708 4.7760
quadrupole: -23.1802 28.7159 -5.5356 5.9074 0.4708 4.7760
hfenergy: -1145.6545846 hartree
pointgroup: C01[X(C20H26N4O2)]
dipole: -1.9910817 0.2833848 -0.0498592 debye
polarizability: 284.1793987|60.2121581|192.6752592|-3.1434783|6.5122419|279.6742414 unknown
InChI: InChI=1S/C20H26N4O2/c21-19(22)15-7-5-9-17(13-15)25-11-3-1-2-4-12-26-18-10-6-8-16(14-18)20(23)24/h5-10,13-14,21,23H,1-4,11-12,22,24H2
charge 0 multiplicity 1
52 atoms
O  2.846606 -1.045533 -0.489039
O  0.383498 2.941283 0.874162
N  -1.427422 -4.172537 -3.444046
N  -5.098135 1.371512 2.911135
N  0.723265 -3.499545 -4.329384
N  -3.001027 1.021726 4.072389
C  4.023968 1.687427 -0.103309
C  3.363268 2.653384 0.911024
C  4.512156 0.364859 0.536938
C  2.551433 3.788781 0.240896
C  3.374416 -0.620928 0.823865
C  1.195953 3.320962 -0.300447
C  1.790584 -1.968434 -0.511177
C  -0.919765 2.473141 0.656577
C  1.361137 -2.365349 -1.798118
C  -1.643333 2.134178 1.82295
C  1.163266 -2.492959 0.648321
C  -1.517897 2.337722 -0.622988
C  0.302526 -3.286958 -1.944064
C  -2.969015 1.661151 1.727215
C  0.112272 -3.424268 0.494518
C  -2.841391 1.851083 -0.711427
C  -0.322159 -3.82666 -0.78491
C  -3.571894 1.514361 0.446439
C  -0.126337 -3.665215 -3.333376
C  -3.700442 1.326573 2.996059
H  3.317799 1.432415 -0.917023
H  4.880219 2.201516 -0.58348
H  4.151865 3.095326 1.551822
H  2.682911 2.102441 1.588522
H  5.039047 0.577351 1.489455
H  5.237007 -0.137874 -0.13078
H  3.130768 4.224012 -0.598788
H  2.366004 4.604255 0.965341
H  2.562702 -0.147941 1.414233
H  3.745606 -1.509376 1.374758
H  1.304823 2.444644 -0.972037
H  0.684551 4.135483 -0.853577
H  1.851006 -1.972001 -2.692879
H  -1.180431 2.22721 2.809044
H  1.474363 -2.188655 1.651436
H  -0.971106 2.590215 -1.535658
H  -0.365744 -3.840864 1.38793
H  -3.29796 1.72432 -1.699423
H  -1.104388 -4.589156 -0.869349
H  -4.577338 1.091227 0.34451
H  -2.083646 -4.116824 -2.668579
H  -1.776443 -4.491636 -4.345116
H  -5.563403 1.783339 2.105357
H  -5.667475 1.123554 3.717476
H  0.325505 -3.757145 -5.256962
H  -3.592472 0.841308 4.910668
