program: Gaussian 09
title: 000147560
version: EM64L-G09RevD.01
frameworkgroup: C1[X(C11H12N2S)]
method: RPBEPBE
basis: SDD
operation: Freq
keyword: #p
keyword: freq=noraman
keyword: PBEPBE/SDD
title: #p freq=noraman PBEPBE/SDD
converged: YES YES NO NO
title: Mulliken charges:
elementType: S N N C C C C C C C C C C C H H H H H H H H H H H H
charge: 0.186221 -0.072864 -0.572072 -0.256701 0.264048 -0.497146 0.328408 -0.665282 -0.374201 -0.384523 -0.197575 -0.237988 -0.249937 -0.242889 0.227667 0.246357 0.221040 0.220040 0.222421 0.262396 0.239404 0.223965 0.223619 0.226640 0.326279 0.332673
chargesum: 0.00000
title: Mulliken charges with hydrogens summed into heavy atoms:
elementType: S N N C C C C C C C C C C C
charge: 0.186221 -0.072864 0.086880 -0.256701 0.264048 -0.023122 0.328408 -0.001780 -0.111805 -0.145120 -0.197575 -0.014023 -0.026318 -0.016249
polarizability: 2.17435284e+02 -3.54662416e-01 1.66391084e+02 -9.26679861e-01 -1.62916372e+00 7.39824199e+01
1716.lowfreq: -7.5332 -4.5406 -0.0010 0.0004 0.0011 4.0505 44.5452 82.3312 90.9608
frequency: 44.4996 82.3234 90.9392 96.8757 127.0475 190.9720 216.7176 245.1377 273.5288 280.3717 303.2739 321.3402 376.7023 407.6601 411.4194 454.5646 486.7706 533.8397 578.4338 581.6851 615.4583 625.9702 658.6865 675.2383 702.4315 763.1681 774.7903 828.8611 853.4828 924.4263 941.9993 976.8289 988.5305 993.8854 996.9200 1030.0948 1052.9395 1064.9513 1085.8782 1134.3858 1171.4286 1178.4509 1188.8738 1254.6252 1272.1857 1303.1322 1318.2481 1332.4798 1377.8921 1388.5854 1433.0906 1468.5342 1470.5511 1479.5048 1485.0628 1542.8395 1580.2017 1584.4385 1612.7884 1630.6727 2980.7280 2983.8969 3041.7875 3080.0040 3084.5359 3122.5248 3132.9575 3150.2970 3161.3468 3169.8175 3560.7360 3713.0574
redmass: 3.4673 5.7997 3.4497 4.0979 4.0513 1.0953 4.8103 3.8595 2.0782 1.8540 2.5321 4.2769 2.5947 2.2278 1.6207 5.8622 3.9058 4.4504 7.1703 4.9561 6.3323 5.0746 6.1846 5.1722 1.7693 1.7211 2.0025 2.1737 1.2508 1.4347 2.4602 1.3992 4.7225 1.4583 2.6137 2.0772 2.3537 1.6579 1.5974 2.4405 1.0582 3.0520 1.1226 1.5276 2.0934 1.9013 1.4065 2.5021 7.6478 1.2029 2.2881 1.0576 1.0812 2.1566 1.1123 7.6727 2.1024 4.1483 5.2039 2.5303 1.0351 1.0629 1.0975 1.1001 1.1007 1.0846 1.0889 1.0935 1.0951 1.0993 1.0449 1.1047
irintensity: 0.2189 0.9347 0.0559 5.2826 1.5824 0.5247 1.8139 4.8943 33.5694 38.3346 26.6703 8.2983 57.1907 44.1603 125.4583 3.4040 8.7792 1.1439 4.1951 10.3481 0.0852 12.1141 16.0376 17.1916 49.2190 0.3530 48.9072 25.8744 0.8157 4.1131 11.5339 0.6037 0.7143 1.5010 8.1534 9.5573 6.9324 2.3567 8.2746 4.8157 0.1322 15.6999 1.2473 22.8905 64.6559 12.2141 1.1202 17.3076 3.9568 13.6355 8.3447 12.0585 3.0360 21.1916 12.0628 8.9862 29.9638 8.6004 12.4470 517.8222 37.2340 28.6760 3.8145 50.1670 38.1042 1.0328 12.6356 35.8392 23.5362 10.6703 110.8105 45.3646
temp: 298.150 k
press: 1.00000 atm
elementType: 16 7 7 6 6 6 6 6 6 6 6 6 6 6 1 1 1 1 1 1 1 1 1 1 1 1
symmnumber: 1
zpe: 538608.5 jmol-1
zpe.correction: 0.205145 hartree
zpe.thermalcorrener: 0.218588 hartree
zpe.thermalcorrenthalpy: 0.219532 hartree
zpe.thermalcorrgfe: 0.164949 hartree
zpe.sumelectzpe: -932.929124 hartree
zpe.sumelectthermal: -932.915681 hartree
zpe.sumelectthermalent: -932.914737 hartree
zpe.sumelectthermalfe: -932.969321 hartree
dipole: -1.8582 -0.2511 0.0509
dipole: 1.8758
quadrupole: -74.1772 -76.7495 -95.0089
quadrupole: 8.9801 1.1850 0.0082
quadrupole: 7.8013 5.2291 -13.0303 8.9801 1.1850 0.0082
hfenergy: -933.1342693 hartree
pointgroup: C01 [X(C11H12N2S1)]
dipole: 0.7360176 0.0168502 0.0514085 debye
dipolederiv: -0.5337442 0.1946644 -0.0032497 -0.0660811 -0.4994722 0.0211397 0.0470357 0.0087738 0.0461408 -1.2478804 -0.3123815 -0.0582537 0.0963908 -0.5940292 -0.0011891 0.0149577 -0.0137709 -0.2242363 -0.9905419 -0.657446 -0.0048141 -0.8411995 -0.9256495 -0.0526946 0.0234814 -0.0148244 -0.7115539 0.4870627 0.0762085 0.0201343 -0.030738 0.0066324 -0.0343806 -0.0614697 -0.0666667 -0.240729 0.3342392 0.1309016 0.0063303 0.2650072 0.2860872 -0.0113348 -0.0096973 0.0407277 0.0280093 -0.0121304 -0.0286432 0.0057747 -0.0449797 0.1287346 -0.0114564 0.0409458 -0.0366135 0.1359898 0.4253095 -0.1317461 0.0125106 -0.0803696 0.0134723 0.0059317 0.0623074 -0.0258132 0.0225023 0.0786947 -0.0179226 0.016114 0.0119785 0.0024386 -0.0428874 0.0135798 0.0012819 -0.0048722 -0.1763007 0.0965652 0.0446663 0.132865 -0.0508713 0.0744118 0.0388302 0.0503181 -0.0958745 -0.1399449 -0.0042508 -0.0258974 -0.0644523 -0.0245057 0.0793535 -0.060343 0.1019053 -0.0913272 1.4074229 0.5449957 0.0677663 0.5129325 1.2832493 0.018371 -0.0092119 0.0253392 0.0894368 0.0230064 -0.0786629 -0.0325265 -0.0779033 0.0599384 0.1214958 -0.0489412 0.1279083 -0.0922042 0.0144002 0.0476985 0.0496895 0.0965051 -0.0137372 0.1077824 0.0986541 0.0874244 -0.083017 -0.008982 0.010174 0.0083095 -0.0320679 -0.0933758 0.0426793 -0.009687 0.0491389 -0.1438158 0.0206451 0.0929336 -0.1097968 0.0434787 -0.0508381 0.0503696 -0.0759543 0.070465 -0.0505772 -0.0781248 -0.0518865 0.0863455 -0.0426297 0.0465073 -0.0384134 0.0592527 -0.0565266 0.0488608 0.0159018 0.040438 -0.1129231 0.0639881 0.0517112 0.0919543 -0.0899002 0.0598974 -0.0462055 0.073915 -0.1017849 0.0041935 -0.0540571 -0.2307408 -0.0193692 0.0188096 -0.0092618 0.0652736 -0.1330654 0.0393448 0.0896926 -0.0201804 0.1068734 -0.0095772 0.0276658 -0.0041685 0.0537504 0.086463 -0.0719091 -0.0561066 -0.0663421 0.0491678 -0.0701369 -0.0615609 -0.0570913 0.1066176 0.0690987 0.0567071 0.0471013 0.0505628 -0.0098199 -0.0915476 0.0475529 -0.0928037 0.070183 0.0259587 0.0734876 0.0323561 0.0949738 -0.0441377 -0.1091308 0.051594 -0.1115978 0.0937634 -0.0122619 -0.0655295 -0.0602606 -0.1001817 0.0143226 -0.1013249 -0.0776699 -0.0971022 0.0842748 -0.1522133 0.0385784 -0.0066528 0.0346001 0.1027951 -0.0330334 -0.0075211 -0.0310072 0.143359 0.2638139 0.0730807 -0.0087398 0.0536246 0.1552968 0.0071989 -0.0248913 -0.0013529 0.3988983 0.1592581 0.0063851 -0.0117634 0.0642752 0.2299503 0.0057882 -0.0078195 -0.0045792 0.3973528 unknown
polarizability: 216.6405788|-6.541014|161.4900038|4.7782365|21.826137|79.6782055 unknown
InChI: InChI=1S/C11H12N2S/c1-2-9-10(13-11(12)14-9)8-6-4-3-5-7-8/h3-7H,2,12H2,1H3
charge 0 multiplicity 1
26 atoms
S  3.026051 -0.731145 0.231092
N  1.293292 1.309874 0.207629
N  3.577518 2.018492 0.275631
C  1.225005 -1.07326 0.173631
C  0.514182 0.126378 0.147788
C  0.773586 -2.510504 0.230337
C  -0.959933 0.287674 0.103442
C  0.934155 -3.281737 -1.108038
C  -1.54471 1.429421 0.720014
C  -1.816985 -0.638446 -0.553319
C  2.587299 1.061416 0.24684
C  -2.941567 1.619393 0.711204
C  -3.215889 -0.447194 -0.560237
C  -3.78728 0.677685 0.077627
H  1.341542 -3.044212 1.017763
H  -0.284376 -2.529298 0.549699
H  0.3573 -2.800199 -1.918214
H  0.581959 -4.324242 -1.001284
H  1.992647 -3.306362 -1.423804
H  -0.882328 2.159804 1.194645
H  -1.391188 -1.486691 -1.098254
H  -3.372065 2.503228 1.195765
H  -3.858098 -1.169072 -1.077705
H  -4.872974 0.825774 0.069397
H  4.559714 1.77454 0.349517
H  3.297844 2.996085 0.242735
