program: Gaussian 09
title: 000147516
version: EM64L-G09RevD.01
frameworkgroup: C1[X(C13H13N3)]
method: RPBEPBE
basis: SDD
operation: Freq
keyword: #pfreq=noraman
keyword: PBEPBE/SDD
title: #p freq=noraman PBEPBE/SDD
converged: YES YES NO NO
title: Mulliken charges:
elementType: N N N C C C C C C C C C C C C C H H H H H H H H H H H H H
charge: -0.418693 0.014340 -0.212607 0.498563 0.488300 -0.581219 -0.427446 -0.395972 -0.182189 -0.806768 0.304579 -0.372439 -0.372493 -0.198723 -0.198714 -0.246372 0.225510 0.232820 0.275104 0.225492 0.223800 0.226912 0.237578 0.304694 0.237857 0.237811 0.226024 0.226025 0.228227
chargesum: 0.00000
title: Mulliken charges with hydrogens summed into heavy atoms:
elementType: N N N C C C C C C C C C C C C C
charge: -0.113999 0.014340 -0.212607 0.498563 0.488300 -0.355709 -0.194626 -0.120869 0.043302 -0.118477 0.304579 -0.134582 -0.134682 0.027300 0.027311 -0.018145
polarizability: 3.08474724e+02 -7.51743691e+00 1.28307850e+02 2.09919150e-01 -2.56725224e-01 1.10974920e+02
1716.lowfreq: -93.0574 -3.8827 -0.0008 -0.0007 -0.0006 3.2844 8.7033 30.4970 40.6985
frequency: -93.0572 30.2180 40.3515 46.7745 78.4174 136.9081 172.0289 209.5388 221.3404 248.0826 301.7150 343.9927 397.6255 437.2600 444.5208 457.3159 502.9914 516.0235 563.1817 609.7581 612.8102 652.2143 695.5321 697.1435 711.5786 745.3948 773.7119 796.7517 837.3409 849.4560 871.9817 905.0633 906.5333 944.1795 964.4916 984.6882 985.4480 985.7387 987.3353 1000.5905 1022.4329 1047.5547 1074.6905 1094.0661 1136.4064 1169.4977 1173.3146 1178.2383 1182.9298 1208.7574 1279.3290 1303.9294 1314.5176 1371.6098 1373.8285 1392.6004 1396.7416 1421.7197 1432.7050 1468.2882 1471.8662 1474.9956 1491.9170 1509.9956 1586.0960 1601.0873 1603.0250 1621.1923 2976.9182 3058.6361 3087.2768 3109.6223 3125.7212 3127.2030 3133.7575 3148.1862 3149.7398 3156.5921 3168.3556 3183.9238 3391.2999
redmass: 4.6434 4.0771 1.0269 5.0871 5.4598 4.7052 4.4021 3.1319 4.6622 4.2389 5.1898 3.4217 2.9428 3.2032 4.9360 4.2623 5.0882 4.8164 3.7058 4.3240 6.5135 6.4318 1.8284 1.8045 1.4123 4.9337 2.0740 1.4221 1.2447 5.0537 1.3882 1.4805 1.4118 2.5444 1.3736 5.3649 2.5462 1.9598 1.3244 1.6015 2.1104 1.5618 1.5434 1.5353 4.1896 1.0528 1.3033 1.1314 1.5306 3.2390 2.4007 1.3554 1.4305 5.0667 7.4090 6.3650 1.2335 2.7943 2.2857 2.0486 1.2996 1.0557 2.4363 2.0994 6.3094 6.0338 6.1894 6.1216 1.0385 1.0952 1.0997 1.0912 1.0843 1.0872 1.0880 1.0924 1.0950 1.0966 1.1016 1.0956 1.0745
irintensity: 0.2516 0.2058 0.5695 0.2817 0.4271 1.7626 1.6248 4.2879 0.8173 1.7600 4.3385 6.5443 0.2328 2.2087 8.6099 7.6698 8.8350 2.3568 0.2427 2.5895 0.1288 3.2532 0.0365 48.0707 107.6359 6.7831 65.2136 48.2107 0.0011 11.7727 16.5132 7.2485 6.5061 0.6752 0.0184 2.1394 1.2757 0.9226 0.2167 3.2237 20.4731 20.2138 11.2696 11.1873 266.0622 0.1704 3.5584 7.1551 27.8193 74.4044 113.0154 0.0105 3.1626 129.8017 0.3113 122.8655 10.3328 114.2794 3.8498 153.6880 4.1116 13.5811 83.0879 139.1000 4.1414 39.7074 40.4125 118.1984 38.2905 22.5656 17.3727 18.0150 2.1692 6.9314 5.4631 21.9271 25.8482 31.3497 22.4029 2.5468 2.5143
temp: 298.150 k
press: 1.00000 atm
elementType: 7 7 7 6 6 6 6 6 6 6 6 6 6 6 6 6 1 1 1 1 1 1 1 1 1 1 1 1 1
symmnumber: 1
zpe: 603435.8 jmol-1
zpe.correction: 0.229837 hartree
zpe.thermalcorrener: 0.243335 hartree
zpe.thermalcorrenthalpy: 0.244279 hartree
zpe.thermalcorrgfe: 0.187812 hartree
zpe.sumelectzpe: -666.260109 hartree
zpe.sumelectthermal: -666.246610 hartree
zpe.sumelectthermalent: -666.245666 hartree
zpe.sumelectthermalfe: -666.302133 hartree
dipole: 1.7639 -0.3925 0.0611
dipole: 1.8081
quadrupole: -77.2282 -90.8790 -91.5094
quadrupole: -6.6708 0.2528 -0.0791
quadrupole: 9.3107 -4.3401 -4.9705 -6.6708 0.2528 -0.0791
hfenergy: -666.4899452 hartree
pointgroup: C01 [X(C13H13N3)]
dipole: -0.6921551 0.1621551 0.0255113 debye
polarizability: 308.2765294|-9.6021204|128.4968569|-0.1529423|0.4769231|110.9841076 unknown
InChI: InChI=1S/C13H13N3/c1-11-6-5-9-13(10-11)15-16-14-12-7-3-2-4-8-12/h2-10,15H,1H3
charge 0 multiplicity 1
29 atoms
N  -0.778846 0.874109 -0.002826
N  0.424703 0.227084 -0.002307
N  1.42667 1.068547 0.000128
C  -4.463711 0.253466 -0.013545
C  -2.000945 0.16181 -0.005132
C  -3.208498 0.906367 -0.010578
C  -4.491724 -1.164809 -0.019512
C  -2.034184 -1.256711 -0.006597
C  -3.285574 -1.903266 -0.014143
C  -5.751488 1.059159 0.014411
C  2.726369 0.43797 0.000993
C  3.385412 0.176341 -1.225927
C  3.38518 0.179474 1.228694
C  4.694395 -0.354043 -1.220138
C  4.694148 -0.350955 1.224512
C  5.353981 -0.620214 0.002589
H  -3.17051 2.004103 -0.013189
H  -5.455164 -1.687361 -0.029259
H  -1.098178 -1.820111 -0.005317
H  -3.320514 -2.998512 -0.019902
H  -5.640418 2.025407 -0.508754
H  -6.581128 0.507088 -0.460412
H  -6.057357 1.281556 1.055219
H  -0.767966 1.905934 -0.001525
H  2.871647 0.391199 -2.169067
H  2.87125 0.396792 2.171181
H  5.198121 -0.560802 -2.171184
H  5.197682 -0.5553 2.176181
H  6.370348 -1.028825 0.003205
