program: Gaussian 09
title: 000009796
version: EM64L-G09RevD.01
frameworkgroup: C1[X(C7H4F2O2)]
method: RPBEPBE
basis: SDD
operation: Freq
keyword: #pfreq=noraman
keyword: PBEPBE/SDD
title: #p freq=noraman PBEPBE/SDD
converged: NO YES NO NO
title: Mulliken charges:
elementType: F F O O C C C C C C C H H H H
charge: -0.172575 -0.169291 -0.398732 -0.204880 -0.004584 0.289702 0.248477 -0.369422 -0.374794 -0.140607 0.127916 0.266420 0.267749 0.246113 0.388509
chargesum: 0.00000
title: Mulliken charges with hydrogens summed into heavy atoms:
elementType: F F O O C C C C C C C
charge: -0.172575 -0.169291 -0.010224 -0.204880 -0.004584 0.289702 0.248477 -0.103002 -0.107045 0.105506 0.127916
polarizability: 1.09022532e+02 1.26177768e+00 8.85667670e+01 -1.27325736e+00 -2.54221287e+00 3.88255958e+01
1716.lowfreq: -9.3437 -7.4956 -0.0008 -0.0008 -0.0007 4.7142 47.6480 91.6467 167.1984
frequency: 47.6348 91.6464 167.1977 216.2609 229.7827 275.9319 367.3599 385.8692 462.0520 496.0453 530.1500 565.4514 578.9688 591.9686 652.4988 686.0685 754.8551 774.2465 803.9940 879.6921 958.4844 968.2402 1012.4604 1061.0619 1154.5172 1167.9940 1220.0853 1239.9500 1311.1763 1379.8363 1444.8879 1460.7296 1583.0368 1622.3057 1655.7378 3162.0676 3184.6077 3194.5018 3515.9057
redmass: 11.7425 8.1691 8.6907 9.2810 4.7815 14.1491 7.4099 10.6811 3.9380 6.9266 6.5051 5.3270 5.0392 1.3414 5.4728 3.4663 2.1973 6.2219 2.5325 1.4024 6.8667 1.3191 5.8025 1.8438 1.9136 1.1262 1.8486 5.2951 2.7286 11.4490 2.7555 3.7278 7.4096 8.8608 9.6487 1.0883 1.0931 1.0994 1.0641
irintensity: 1.5465 2.9911 2.0805 1.3159 0.0285 0.7437 3.5009 3.7192 3.1461 1.0162 45.5563 3.8577 6.5762 105.7536 13.1933 68.4905 22.8912 2.0179 62.6716 0.0408 126.4040 2.6307 171.0949 30.3017 83.8843 1.2147 25.9822 10.8501 73.3264 0.5765 92.3810 19.6052 50.5307 92.1588 327.6726 5.0454 0.9562 1.3458 40.1208
temp: 298.150 k
press: 1.00000 atm
elementType: 9 9 8 8 6 6 6 6 6 6 6 1 1 1 1
symmnumber: 1
zpe: 250350.1 jmol-1
zpe.correction: 0.095353 hartree
zpe.thermalcorrener: 0.104582 hartree
zpe.thermalcorrenthalpy: 0.105526 hartree
zpe.thermalcorrgfe: 0.060229 hartree
zpe.sumelectzpe: -618.488558 hartree
zpe.sumelectthermal: -618.479330 hartree
zpe.sumelectthermalent: -618.478385 hartree
zpe.sumelectthermalfe: -618.523683 hartree
dipole: -2.8801 -1.1867 0.8762
dipole: 3.2359
quadrupole: -46.3799 -66.4106 -64.2581
quadrupole: -3.9595 3.5183 2.2701
quadrupole: 12.6363 -7.3944 -5.2419 -3.9595 3.5183 2.2701
hfenergy: -618.5839115 hartree
pointgroup: C01 [X(C7H4F2O2)]
dipole: -1.144269 0.4472646 -0.333757 debye
dipolederiv: -0.3615462 -0.3349151 -0.0525286 -0.2692841 -0.8064996 -0.0877984 -0.0574795 -0.0980294 -0.1408918 -0.3255319 0.3069354 0.0426429 0.2420058 -0.8217698 -0.0763574 0.0345261 -0.08701 -0.1329276 -0.6194288 -0.334244 0.3117076 -0.3553296 -0.6799307 0.2861559 0.3390006 0.289245 -0.6697159 -0.8501992 0.2275173 -0.1850622 0.1291787 -0.5635604 0.2808059 -0.0084709 0.2488055 -0.5470844 -0.6464839 -0.0014912 0.0097464 0.0143529 -0.3161289 0.0130439 -0.030053 0.0206459 -0.0840933 0.6423011 0.4085843 0.0507323 0.0888279 0.950681 0.1161472 0.1211424 0.0989598 0.1525151 0.6067156 -0.3844917 -0.0442003 -0.0740817 0.9614231 0.103755 -0.0974546 0.0956182 0.1304287 -0.3146917 -0.2746674 -0.0337437 -0.0720006 -0.1345709 -0.0008136 -0.0071978 -0.0023354 -0.1778712 -0.2913958 0.2803794 0.0277845 0.0768147 -0.1524777 0.0002505 0.0201437 0.0027167 -0.1745586 0.1627789 0.0028865 0.0049946 0.0059644 0.2532764 0.0339133 0.0026716 0.0355771 -0.1091501 1.7605121 0.0413746 -0.0598553 0.1315537 0.8748111 -0.6810442 -0.1779588 -0.5952472 0.8620893 0.0711935 0.044063 0.0020842 0.0490737 0.0019879 -0.0168689 -0.0047599 -0.0219533 0.1874109 0.0698654 -0.0455043 -0.0065938 -0.0499916 0.0083971 -0.0177135 -0.0025872 -0.0216468 0.1887643 -0.0694852 0.0041576 -0.0032882 0.0038722 0.0956291 -0.0068029 -0.0031629 -0.0040334 0.1600417 0.1653961 0.0594156 -0.0644203 0.0790436 0.3287324 0.0533274 -0.1283599 0.0386873 0.3550429 unknown
polarizability: 109.0749033|-0.818216|88.5981798|1.1713755|-1.5460659|38.7418116 unknown
InChI: InChI=1S/C7H4F2O2/c8-4-2-1-3-5(9)6(4)7(10)11/h1-3,10H
charge 0 multiplicity 1
15 atoms
F  0.255928 2.416251 0.271379
F  0.15088 -2.404886 -0.20733
O  2.361321 0.891169 -0.752051
O  2.443354 -0.887402 0.741214
C  0.28227 0.001734 0.021154
C  -0.443814 1.214248 0.114197
C  -0.501925 -1.174101 -0.082545
C  -1.846708 1.276011 0.101244
C  -1.905267 -1.168283 -0.106533
C  -2.574719 0.071703 -0.013009
C  1.774695 -0.071946 0.073249
H  -2.342989 2.245825 0.18641
H  -2.44634 -2.112763 -0.201936
H  -3.668115 0.099082 -0.027074
H  3.352031 0.834657 -0.666468
