program: Gaussian 09
title: 000149981
version: EM64L-G09RevD.01
frameworkgroup: C1[X(C11H9N3)]
method: RPBEPBE
basis: SDD
operation: Freq
keyword: #pfreq=noraman
keyword: PBEPBE/SDD
title: #p freq=noraman PBEPBE/SDD
converged: NO NO NO NO
title: Mulliken charges:
elementType: N N N C C C C C C C C C C C H H H H H H H H H
charge: -0.252426 -0.048911 -0.025782 -0.015198 0.059020 0.183598 -0.185482 -0.288632 0.163216 -0.314881 -0.278375 -0.241146 -0.176014 -0.791389 0.278989 0.256549 0.261646 0.234471 0.232331 0.239876 0.229374 0.229358 0.249806
chargesum: 0.00000
title: Mulliken charges with hydrogens summed into heavy atoms:
elementType: N N N C C C C C C C C C C C
charge: -0.252426 -0.048911 -0.025782 -0.015198 0.059020 0.183598 0.093507 -0.032083 0.163216 -0.053235 -0.043904 -0.008815 0.063863 -0.082850
polarizability: 2.42259222e+02 1.10232590e+01 1.40326188e+02 9.68607754e-03 -2.66209701e-03 5.74960776e+01
1716.lowfreq: -0.0007 0.0003 0.0004 4.1229 5.8352 20.5803 82.1785 101.2543 124.5777
frequency: 82.0131 101.2433 124.5756 179.8363 215.2572 282.7684 338.5336 364.6580 417.2824 419.5796 458.3790 517.9733 557.9333 571.4004 610.9758 625.0469 631.0711 709.4829 738.2164 758.7997 784.9600 792.3020 836.4068 844.6459 849.9701 890.7673 944.7456 972.6279 975.9789 979.1479 989.8333 1045.0704 1052.7076 1096.6958 1120.4170 1138.4760 1200.4445 1234.4122 1258.8396 1260.3993 1331.0942 1344.5141 1350.0365 1384.0217 1392.4612 1439.2971 1448.3844 1468.8926 1476.7514 1500.3969 1524.5952 1554.9458 1590.8766 1640.4934 2977.8828 3055.3100 3109.3715 3142.8757 3150.1394 3170.3690 3172.6236 3184.0202 3195.5362
redmass: 1.1235 3.1607 3.9369 4.0473 4.2648 5.2292 3.1160 4.6611 5.8502 3.3429 3.6859 6.1218 5.1905 3.7663 7.2477 3.5698 6.5584 6.1128 3.9706 1.4221 5.6639 6.7265 1.4394 7.2558 1.4177 5.0299 1.3362 1.3287 1.7396 1.2955 2.5109 1.5483 3.4843 2.0186 1.3645 1.3246 2.0682 2.6268 2.3279 2.7150 2.7252 3.1246 2.5990 2.0126 1.6646 2.6704 2.2490 1.0466 1.7428 4.1753 6.6852 6.5634 7.2508 6.9321 1.0380 1.0975 1.0980 1.0891 1.0885 1.0973 1.0888 1.0964 1.1015
irintensity: 0.7469 1.3506 3.4220 3.0303 0.4347 2.5632 3.1405 5.2147 3.9679 7.0125 6.0753 0.1577 3.2599 1.1169 3.2214 5.9794 0.6708 2.2262 7.6883 99.3627 1.0195 0.5266 36.6070 1.9610 1.2638 0.3237 0.8660 0.3457 11.1314 0.3920 6.6086 7.1416 3.8486 1.3288 0.0400 31.0809 7.5432 11.5298 56.2846 9.8688 34.8390 27.1881 18.2795 70.4842 17.7898 53.1692 0.0507 15.4078 11.8367 52.1398 4.3589 39.8924 0.6958 30.4187 29.2529 20.0910 8.8108 9.6756 7.1230 12.4942 3.0398 3.9634 9.2824
temp: 298.150 k
press: 1.00000 atm
elementType: 7 7 7 6 6 6 6 6 6 6 6 6 6 6 1 1 1 1 1 1 1 1 1
symmnumber: 1
zpe: 464024.0 jmol-1
zpe.correction: 0.176737 hartree
zpe.thermalcorrener: 0.187107 hartree
zpe.thermalcorrenthalpy: 0.188052 hartree
zpe.thermalcorrgfe: 0.140631 hartree
zpe.sumelectzpe: -587.875243 hartree
zpe.sumelectthermal: -587.864873 hartree
zpe.sumelectthermalent: -587.863929 hartree
zpe.sumelectthermalfe: -587.911350 hartree
dipole: -0.1945 -1.8245 -0.0001
dipole: 1.8348
quadrupole: -60.2841 -81.3216 -85.0489
quadrupole: 5.9422 0.0009 0.0001
quadrupole: 15.2674 -5.7700 -9.4973 5.9422 0.0009 0.0001
hfenergy: -588.0519808 hartree
pointgroup: C01 [X(C11H9N3)]
dipole: -0.0937943 0.715756 0.0000213 debye
dipolederiv: -0.1621012 -0.2637338 0.0000252 0.5393363 -0.4927835 -0.0000025 -0.0000349 0.0000691 0.0026771 -0.9872292 0.1553728 0.0000229 0.2173997 -0.4401915 -0.0000015 0.0000641 -0.0000144 -0.2692599 -0.3204525 -0.0973954 -0.0000164 0.048433 -0.3783752 -0.0000099 -0.0000145 0.0000128 -0.2122353 0.3527863 0.2116545 0.0000098 -0.5026747 0.0348482 0.0000276 0.0000122 -0.000008 0.0942579 0.3960374 0.1109129 -0.0000117 0.6414669 -0.0522484 -0.0000227 -0.0000617 0.0000052 0.0510442 0.3109176 -0.2623508 -0.0000103 -0.7383852 0.5659813 -0.0000104 0.0000386 -0.0000274 0.0676104 0.2777593 0.0207597 -0.0000434 -0.3008708 0.1150818 0.0000296 -0.0000175 -0.0000288 -0.0549401 0.2278281 -0.0812243 -0.000017 -0.0238082 0.195374 -0.0000216 0.0000112 -0.0000325 -0.1282134 0.3471654 0.2186417 -0.0000137 0.5576429 0.3597782 -0.0000544 -0.0001719 -0.0000861 -0.0058487 -0.0196698 0.188252 -0.0000186 0.1186145 -0.014079 -0.0000007 -0.0000152 0.0000018 -0.1548375 -0.1173585 -0.0639351 0.00001 -0.5001307 -0.1861444 0.0000334 0.0000418 0.0000164 -0.1504511 -0.1878323 -0.1921936 0.0000026 0.0066717 -0.0272026 0.0000061 -0.0000382 0.0000255 -0.2026221 0.0217094 0.095003 -0.0000127 0.0219922 0.1776915 -0.0000227 0.0000098 -0.0000338 -0.1302895 -0.2246912 -0.1374046 0.0000375 -0.1061238 -0.0435371 -0.0000029 0.0002766 0.0000823 0.0580733 0.081106 -0.0602041 0.0000116 -0.0108954 0.0369796 0.0000064 0.00002 0.0000122 0.1812426 0.0889235 0.0088703 -0.000001 0.0496965 -0.0557372 0.0000099 -0.000005 0.0000262 0.1534109 0.0648046 -0.0253212 0.0000069 -0.0741475 -0.004306 0.0000073 0.0000031 -0.0000011 0.1728028 -0.1155838 0.0601331 -0.0000049 0.0512804 0.0897012 0.0000004 -0.0000337 0.0000007 0.1609871 0.0402221 0.0762122 0.0000111 0.0841068 -0.0389568 -0.0000027 0.0000225 -0.0000064 0.1744169 -0.1138775 -0.01253 0.0000181 -0.0007859 0.0970211 0.0000027 0.0000071 0.0000088 0.1629019 -0.0214219 -0.0300724 0.0993425 -0.0353967 0.0683257 -0.0509082 0.1432595 -0.0019562 -0.0440681 -0.0215394 -0.0299754 -0.0994043 -0.0351858 0.0682833 0.0510251 -0.1433444 0.0020445 -0.0438447 0.0824978 0.1105288 0.000056 -0.0082362 -0.0755041 -0.0000883 -0.0000297 -0.0001108 0.1171851 unknown
polarizability: 242.7310947|-8.5551268|139.854316|-0.0096191|-0.0028947|57.4960776 unknown
InChI: InChI=1S/C11H9N3/c1-8-5-6-9-11(12-8)14-7-3-2-4-10(14)13-9/h2-7H,1H3
charge 0 multiplicity 1
23 atoms
N  -0.90371 0.409679 -0.000152
N  -0.595975 -1.898736 -0.000014
N  1.45439 1.134069 -0.000236
C  0.484161 0.19146 -0.000122
C  0.641562 -1.238571 -0.000114
C  -1.513843 -0.897786 0.000005
C  -1.629337 1.591999 -0.000091
C  1.971135 -1.728254 -0.000146
C  2.729662 0.640734 -0.000223
C  -2.943083 -0.948504 0.000099
C  3.00385 -0.76989 -0.000187
C  -3.011519 1.522532 -0.000004
C  -3.673302 0.237205 0.000118
C  3.861956 1.647598 -0.000296
H  -1.042899 2.513849 -0.000168
H  2.177093 -2.80268 -0.000069
H  -3.419115 -1.932232 0.000132
H  4.049234 -1.096533 -0.000136
H  -3.599477 2.443603 0.000034
H  -4.767842 0.208106 0.000193
H  4.505802 1.526227 -0.891972
H  4.506563 1.52561 0.890742
H  3.451892 2.669916 0.000209
