program: Gaussian 09
title: 000149985
version: EM64L-G09RevD.01
frameworkgroup: C1[X(C20H12O)]
method: RPBEPBE
basis: SDD
operation: Freq
keyword: #pfreq=noraman
keyword: PBEPBE/SDD
title: #p freq=noraman PBEPBE/SDD
converged: YES YES NO NO
title: Mulliken charges:
elementType: O C C C C C C C C C C C C C C C C C C C C H H H H H H H H H H H H
charge: -0.424655 -0.595903 0.433503 0.271389 -0.053270 0.410891 0.321955 0.257695 -0.741190 0.511485 -0.429527 -0.426314 0.168256 -0.485943 -0.226039 -0.378785 -0.488723 -0.371388 -0.200361 -0.254278 -0.249061 0.213155 0.250473 0.228526 0.253128 0.224070 0.231478 0.245566 0.251063 0.229555 0.230903 0.231975 0.360371
chargesum: 0.00000
title: Mulliken charges with hydrogens summed into heavy atoms:
elementType: O C C C C C C C C C C C C C C C C C C C C
charge: -0.064284 -0.595903 0.433503 0.271389 -0.053270 0.410891 0.321955 0.257695 -0.528036 0.511485 -0.179054 -0.197788 0.168256 -0.232815 -0.001970 -0.147308 -0.243156 -0.120325 0.029194 -0.023375 -0.017085
polarizability: 3.94667745e+02 -1.37784798e+01 2.65941653e+02 -1.08936911e-02 2.12911850e-03 8.09684385e+01
1716.lowfreq: -0.0009 0.0002 0.0004 4.5544 6.0726 10.6556 34.5277 71.2114 115.0770
frequency: 34.4287 71.1864 115.0689 127.3583 143.4610 201.5353 243.5245 253.6841 256.7998 273.4354 307.6881 331.8944 340.4438 410.4553 428.4077 463.0031 495.2923 498.7795 512.9394 538.1265 558.6127 578.2006 580.2007 595.1827 632.9504 640.0953 643.8835 682.1299 732.8022 755.4135 761.6507 771.2876 783.1658 786.9274 802.1629 847.7103 852.8762 868.1243 896.8421 906.5247 919.2720 932.0472 934.1466 961.3219 970.4541 981.4385 991.4479 1025.6360 1042.5255 1043.9008 1057.0403 1107.8115 1124.5855 1144.5248 1158.8020 1175.6724 1184.1868 1201.3325 1217.6394 1245.1524 1280.0288 1286.0706 1298.4740 1324.4484 1343.0412 1391.3016 1400.2395 1405.3819 1428.1812 1435.9079 1458.3273 1464.4903 1474.4436 1495.0555 1535.3730 1584.2692 1606.0674 1615.5935 1618.6371 1622.2050 1630.0081 3090.7476 3119.6579 3127.4187 3132.3623 3136.2008 3142.1123 3147.6334 3154.7571 3160.1120 3165.1043 3174.8910 3603.8887
redmass: 3.0107 4.6563 4.5098 3.6209 5.9935 2.1078 4.6796 4.9214 2.9288 2.5815 5.4022 6.5411 4.4247 5.5468 3.6710 3.8345 6.9377 3.0659 6.2409 3.5916 6.3626 3.8134 7.0136 5.8840 6.7387 3.8055 3.1790 6.5464 2.0647 6.5403 1.3404 2.1614 5.6087 1.6937 1.8941 5.7853 1.4827 1.9611 1.4734 6.2540 1.5635 3.2753 5.8038 1.4233 1.3684 1.3813 1.3531 3.9659 2.3639 2.5602 1.8844 2.1457 1.5878 1.8510 1.4614 1.0886 1.5867 1.4071 1.4271 2.6864 1.8132 3.0519 1.7414 2.3858 2.7708 5.2391 2.7944 4.3066 3.3942 3.1325 3.3866 2.9555 3.5428 4.1657 4.8565 7.1503 8.0104 7.6155 6.4817 7.4835 7.6783 1.0913 1.0872 1.0860 1.0875 1.0867 1.0921 1.0935 1.0937 1.0982 1.1001 1.0974 1.0657
irintensity: 6.8527 2.2358 0.1248 8.4555 0.4369 31.6094 0.5706 2.1794 20.6425 58.4233 2.9267 0.4785 5.5702 1.5748 0.1784 4.8235 0.4731 10.6172 15.7757 2.3123 5.9679 0.5371 1.3259 1.7129 4.2206 1.2104 1.9609 0.7249 0.1204 4.9847 43.5659 87.7345 1.7019 68.3146 20.0154 2.2215 23.7450 0.3003 4.2577 9.2463 1.4208 11.4671 3.2176 5.8175 1.1354 1.8827 0.1266 2.1632 23.3997 5.7027 1.7632 4.1333 79.0816 67.1401 50.0903 0.4384 15.2688 0.0231 2.3906 6.0618 0.0380 14.2912 2.3583 2.0063 0.7161 1.1974 4.1317 12.0667 5.1650 48.1954 27.2261 11.7720 6.4099 21.7096 13.9525 57.5734 3.8041 10.1305 8.7638 31.3587 2.4598 30.2249 7.2642 2.2155 4.7821 4.6475 11.5077 13.0532 14.8795 43.7333 43.2711 18.3922 10.4167
temp: 298.150 k
press: 1.00000 atm
elementType: 8 6 6 6 6 6 6 6 6 6 6 6 6 6 6 6 6 6 6 6 6 1 1 1 1 1 1 1 1 1 1 1 1
symmnumber: 1
zpe: 663901.3 jmol-1
zpe.correction: 0.252867 hartree
zpe.thermalcorrener: 0.267612 hartree
zpe.thermalcorrenthalpy: 0.268557 hartree
zpe.thermalcorrgfe: 0.211255 hartree
zpe.sumelectzpe: -843.215450 hartree
zpe.sumelectthermal: -843.200705 hartree
zpe.sumelectthermalent: -843.199761 hartree
zpe.sumelectthermalfe: -843.257063 hartree
dipole: 1.7804 0.8957 -0.0017
dipole: 1.9930
quadrupole: -104.6935 -105.7962 -129.3959
quadrupole: -6.8580 0.0010 0.0090
quadrupole: 8.6017 7.4990 -16.1007 -6.8580 0.0010 0.0090
hfenergy: -843.4683171 hartree
pointgroup: C01 [X(C20H12O1)]
dipole: 0.6915549 -0.3695137 0.0070103 debye
polarizability: 395.2667723|10.5947513|265.3147878|0.7806013|-2.1566216|80.9962762 unknown
InChI: InChI=1S/C20H12O/c21-18-10-4-9-16-15-8-3-7-14-13-6-2-1-5-12(13)11-17(19(14)15)20(16)18/h1-11,21H
charge 0 multiplicity 1
33 atoms
O  -2.403439 3.139232 -0.059118
C  -0.010082 -0.731376 -0.007371
C  -0.368062 0.673662 -0.025139
C  -1.178604 -1.551487 -0.001319
C  -1.848963 0.717258 -0.030333
C  1.310309 -1.229135 0.002255
C  -2.344539 -0.639114 -0.016038
C  2.393347 -0.24271 -0.006729
C  0.660555 1.606469 -0.03342
C  2.045997 1.166157 -0.024327
C  -1.024693 -2.944871 0.015873
C  1.445033 -2.655099 0.019894
C  -2.773067 1.785008 -0.045295
C  -3.723271 -0.910497 -0.017462
C  0.301735 -3.478759 0.026462
C  3.771432 -0.604237 0.000816
C  3.095812 2.136693 -0.03313
C  -4.165003 1.514709 -0.046944
C  -4.628898 0.182641 -0.033243
C  4.78201 0.369353 -0.008328
C  4.44226 1.751563 -0.025356
H  0.496293 2.692755 -0.047243
H  -1.885285 -3.622399 0.021303
H  2.435079 -3.122688 0.028543
H  -4.097865 -1.938831 -0.006715
H  0.432416 -4.566704 0.040065
H  4.050191 -1.663165 0.013998
H  2.830984 3.200866 -0.046376
H  -4.859735 2.359596 -0.058888
H  -5.708208 -0.003789 -0.034785
H  5.834605 0.066267 -0.002319
H  5.233001 2.509245 -0.032392
H  -1.421043 3.242789 -0.055638
