program: Gaussian 09
title: 000149977
version: EM64L-G09RevD.01
frameworkgroup: C1[X(C10H8N4)]
method: RPBEPBE
basis: SDD
operation: Freq
keyword: #pfreq=noraman
keyword: PBEPBE/SDD
title: #p freq=noraman PBEPBE/SDD
converged: YES YES NO YES
title: Mulliken charges:
elementType: N N N N C C C C C C C C C C H H H H H H H H
charge: -0.248827 -0.090597 -0.044608 -0.659659 0.049321 -0.051093 0.196253 0.332977 -0.184832 -0.317791 -0.241137 -0.319340 -0.176811 -0.356145 0.281133 0.256975 0.217085 0.231013 0.238187 0.234373 0.343071 0.310454
chargesum: 0.00000
title: Mulliken charges with hydrogens summed into heavy atoms:
elementType: N N N N C C C C C C C C C C
charge: -0.248827 -0.090597 -0.044608 -0.006134 0.049321 -0.051093 0.196253 0.332977 0.096300 -0.060816 -0.010124 -0.102255 0.061376 -0.121773
polarizability: 2.33116015e+02 -1.43862339e+00 1.45248849e+02 -7.88293242e-04 -4.57614275e-03 5.22820832e+01
1716.lowfreq: -11.5390 -6.7772 -0.0009 -0.0007 -0.0003 7.2006 100.2707 126.5348 179.4108
frequency: 100.2673 126.5344 179.4104 224.9094 279.6888 297.4344 317.7062 419.3276 439.2417 450.1337 512.2702 535.2034 551.5337 577.5185 584.6000 588.7598 625.1526 643.0927 702.2638 740.4758 756.8653 776.2357 816.3544 834.9851 846.3659 848.3009 927.5545 934.2393 944.4653 975.8283 993.1934 1014.8398 1064.3122 1102.3736 1131.0249 1174.5148 1231.8456 1267.8260 1297.0716 1314.3473 1330.6314 1346.3111 1375.5580 1402.5722 1446.7130 1483.1360 1510.2587 1524.5170 1571.5506 1598.2458 1633.1155 1642.5895 3132.7964 3152.0701 3156.1821 3173.9893 3185.7449 3197.0061 3544.9414 3695.1782
redmass: 5.1922 3.9586 4.2548 5.5556 4.9051 4.0820 4.7475 1.5314 1.9214 6.0851 5.5530 1.1266 3.4073 7.2796 5.9700 4.1796 5.4116 6.5283 7.1777 4.4765 1.3887 5.0746 1.5126 6.4138 8.2848 1.4038 1.3747 5.0083 1.3405 1.2919 2.3634 2.1143 2.4985 1.5423 1.4547 1.5035 2.8603 2.3758 2.5275 2.2394 2.3605 2.5836 3.2879 3.8782 3.4209 3.8182 4.7915 6.6834 6.5676 2.6303 1.9006 5.1436 1.0875 1.0882 1.0964 1.0891 1.0962 1.1012 1.0452 1.1042
irintensity: 10.0805 0.0530 7.2013 0.5667 8.3177 1.6766 3.5692 62.2644 105.1278 3.0982 0.5033 142.4137 0.0400 4.9967 2.6004 2.3250 0.0522 1.8690 1.3388 2.4058 103.2036 5.3903 51.0133 0.7850 9.1739 0.4730 0.2755 10.9591 1.3490 0.3829 4.0453 4.7424 11.0123 2.7446 21.1200 5.6713 19.8251 16.7020 91.5667 3.5524 52.7381 51.0629 28.5633 22.7203 8.1227 23.2935 0.4388 4.3893 42.5287 27.7859 248.3287 220.7652 10.5628 7.1596 35.9495 4.0213 4.4564 9.3373 97.6970 38.1200
temp: 298.150 k
press: 1.00000 atm
elementType: 7 7 7 7 6 6 6 6 6 6 6 6 6 6 1 1 1 1 1 1 1 1
symmnumber: 1
zpe: 438139.3 jmol-1
zpe.correction: 0.166878 hartree
zpe.thermalcorrener: 0.176864 hartree
zpe.thermalcorrenthalpy: 0.177809 hartree
zpe.thermalcorrgfe: 0.131657 hartree
zpe.sumelectzpe: -603.929279 hartree
zpe.sumelectthermal: -603.919293 hartree
zpe.sumelectthermalent: -603.918348 hartree
zpe.sumelectthermalfe: -603.964500 hartree
dipole: 0.3667 -1.2161 -0.0012
dipole: 1.2702
quadrupole: -53.4645 -77.9855 -86.2741
quadrupole: -6.5135 -0.0008 0.0061
quadrupole: 19.1102 -5.4108 -13.6994 -6.5135 -0.0008 0.0061
hfenergy: -604.096157 hartree
pointgroup: C01 [X(C10H8N4)]
dipole: 0.1352088 -0.4810421 0.0071929 debye
dipolederiv: -0.2139273 -0.2561657 0.0016064 0.5904337 -0.3509894 0.0101364 -0.0104949 0.002618 0.0056823 -0.9465219 -0.0417705 -0.0053972 0.1192135 -0.4465372 0.0032935 -0.0075032 0.0025226 -0.2737205 -0.6933444 0.0401775 -0.0048857 -0.0202854 -0.5424298 0.003997 -0.004105 0.0045888 -0.2233875 -0.5421069 0.4826573 -0.0054283 0.8107383 -1.2003368 0.0138452 -0.0102911 0.0116782 -0.6825442 0.4088003 0.3266269 -0.0012249 0.0161495 0.2566805 -0.0019966 0.0031423 0.0004439 0.0673022 -0.0838132 0.4928258 -0.0077719 0.4129468 0.0361463 0.0030078 -0.0068165 0.0032222 0.0126392 0.5140396 -0.1587467 0.0062603 -0.7338155 0.28381 -0.0093497 0.0142585 -0.0043441 0.0775621 0.6621983 -0.5393828 0.011897 -0.9170631 1.3493524 -0.0239992 0.0168916 -0.0210685 0.1372583 0.3045627 0.0999174 0.001708 -0.2022491 0.0451239 -0.003133 0.0060138 -0.0003028 -0.0546226 -0.045836 0.1045481 -0.0005705 0.0871428 0.0578265 -0.0022511 0.0001456 -0.0022663 -0.1620469 -0.0916529 -0.2166578 0.0040031 0.0088225 -0.0803217 -0.0016134 0.0007714 -0.0036953 -0.2069286 0.0157874 -0.1163723 0.0041088 0.3078037 -0.5839381 0.0074503 -0.0014706 0.0037881 -0.2212227 -0.0293242 0.0744399 -0.0001072 -0.0527021 0.1795357 -0.0049309 0.0015152 -0.003677 -0.1371177 0.445529 -0.1015374 0.0064006 -0.2071029 0.4354544 -0.0089032 0.0082896 -0.0075208 -0.1094681 0.1005388 -0.0436831 -0.0001326 0.0078051 0.0277656 0.0022116 -0.0007637 0.0016652 0.1833396 0.0847662 0.0055942 -0.0008523 -0.0477125 -0.0326988 0.0024445 -0.000042 0.0029181 0.1731373 -0.1545611 0.0023295 -0.0032912 0.0328983 0.0816191 0.0016641 -0.0038493 0.0012453 0.183449 -0.0139781 0.0889951 -0.0028637 0.096429 0.0105059 0.0031173 -0.0029386 0.0030266 0.174688 -0.0930588 -0.0703356 -0.0012548 -0.0650906 0.0710696 0.0007069 -0.0013514 0.0006912 0.1640731 -0.0018184 -0.0996612 -0.000003 -0.1205218 -0.0533854 0.0013383 0.0000143 0.0012318 0.1367974 0.1792393 -0.003533 -0.0015866 -0.0782215 0.2663035 0.0007277 -0.0007238 0.0014463 0.3719918 0.1944817 -0.0702656 -0.0006142 -0.0456187 0.1894437 0.0022365 -0.0006923 0.0017887 0.3831387 unknown
polarizability: 233.0164762|-3.0730609|145.3165921|1.6320487|-1.287175|52.3138792 unknown
InChI: InChI=1S/C10H8N4/c11-7-4-5-12-10-9(7)13-8-3-1-2-6-14(8)10/h1-6H,11H2
charge 0 multiplicity 1
22 atoms
N  -0.965756 0.493513 0.001192
N  0.037391 -1.602492 0.039701
N  1.060845 1.915772 0.00061
N  3.012599 -1.937386 0.068713
C  0.42476 0.717853 0.010794
C  0.999645 -0.586208 0.032737
C  -1.151148 -0.939293 0.01944
C  2.424589 -0.690807 0.046663
C  -2.017185 1.393551 -0.020681
C  -2.49261 -1.423239 0.014313
C  -3.314476 0.904713 -0.025154
C  3.124933 0.548411 0.03703
C  -3.552765 -0.516076 -0.007563
C  2.422208 1.785153 0.014159
H  -1.743235 2.450883 -0.032667
H  -2.649679 -2.504424 0.028078
H  4.220108 0.56468 0.047836
H  -4.148998 1.609864 -0.042036
H  -4.583136 -0.885526 -0.01131
H  2.987748 2.723315 0.007728
H  2.409099 -2.758013 0.074602
H  4.021363 -2.054244 0.078513
