program: Gaussian 09
title: 000009794
version: EM64L-G09RevD.01
frameworkgroup: C1[X(C4H5F3O2)]
method: RPBEPBE
basis: SDD
operation: Freq
keyword: #pfreq=noraman
keyword: PBEPBE/SDD
title: #p freq=noraman PBEPBE/SDD
converged: NO NO NO NO
title: Mulliken charges:
elementType: F F F O O C C C C H H H H H
charge: -0.137636 -0.149953 -0.149987 -0.234626 -0.188812 -0.223612 -0.663541 0.220972 0.342072 0.243831 0.243739 0.219723 0.238915 0.238914
chargesum: 0.00000
title: Mulliken charges with hydrogens summed into heavy atoms:
elementType: F F F O O C C C C
charge: -0.137636 -0.149953 -0.149987 -0.234626 -0.188812 0.263958 0.034011 0.220972 0.342072
polarizability: 6.37540938e+01 4.62214860e+00 5.19923405e+01 -7.17192410e-03 1.76294615e-02 3.99784304e+01
1716.lowfreq: -36.3364 -22.6159 -8.0131 -6.6069 -0.0007 -0.0004 0.0000 21.2805 118.1034
frequency: -30.8564 4.2123 118.0903 121.7104 226.1364 252.6875 275.8138 304.5735 356.9769 388.8743 449.4126 516.0529 640.3673 704.2645 789.7212 795.6675 812.0592 1008.8610 1016.3497 1061.1900 1068.6699 1115.5343 1133.3841 1243.4019 1249.8165 1354.8203 1402.7358 1462.4891 1469.5135 1482.7128 1657.2171 3002.5788 3020.9878 3084.2362 3098.8592 3118.5578
redmass: 4.4029 3.8304 2.7168 5.0602 1.5286 9.5700 3.8126 5.8909 6.5087 6.5811 16.5810 12.2096 15.4226 11.8194 5.5354 1.1043 6.5899 2.1169 12.9577 12.6887 11.9572 2.3033 1.4603 7.1130 1.1362 1.3980 1.2567 1.0392 1.0718 1.0613 11.8906 1.0362 1.0580 1.1073 1.0982 1.1035
irintensity: 0.0015 0.9918 0.7404 0.2007 0.9456 5.9083 5.2250 15.4756 2.1057 1.2698 7.3572 1.1002 14.0419 14.7763 23.6256 3.7846 1.3709 24.7048 238.9069 333.6185 275.6394 2.7619 11.1070 109.4221 0.3281 2.6118 25.4088 13.4017 4.7051 16.0156 218.6605 12.4136 11.0329 4.0067 20.0904 34.1307
temp: 298.150 k
press: 1.00000 atm
elementType: 9 9 9 8 8 6 6 6 6 1 1 1 1 1
symmnumber: 1
zpe: 238107.9 jmol-1
zpe.correction: 0.090691 hartree
zpe.thermalcorrener: 0.099594 hartree
zpe.thermalcorrenthalpy: 0.100539 hartree
zpe.thermalcorrgfe: 0.053915 hartree
zpe.sumelectzpe: -604.675371 hartree
zpe.sumelectthermal: -604.666467 hartree
zpe.sumelectthermalent: -604.665523 hartree
zpe.sumelectthermalfe: -604.712147 hartree
dipole: -4.4648 -0.4417 -0.0071
dipole: 4.4866
quadrupole: -44.0745 -56.8501 -50.2130
quadrupole: -1.3624 -0.0056 -0.0117
quadrupole: 6.3047 -6.4709 0.1662 -1.3624 -0.0056 -0.0117
hfenergy: -604.7660617 hartree
pointgroup: C01 [X(C4H5F3O2)]
dipole: -1.756783 0.1717274 0.0030462 debye
dipolederiv: -0.3799661 -0.0323652 0.0002481 0.0274203 -0.8400014 -0.0029505 0.0006923 -0.0023154 -0.2739253 -0.5537532 0.0411793 -0.262099 0.0009761 -0.3188455 0.0893371 -0.2160786 0.1189449 -0.6327091 -0.5470002 0.0368759 0.2594582 -0.0021262 -0.3175039 -0.0874446 0.2142485 -0.1169756 -0.6405058 -1.4746262 0.3698598 -0.0000385 0.3170275 -0.5992461 -0.0004362 -0.0021847 0.0012704 -0.2537084 -0.5687135 -0.0751715 0.0005517 0.3476014 -0.8551983 0.002225 0.0013557 -0.0015171 -0.2712818 0.9394472 -0.0871088 0.0005668 0.0811726 0.2296149 0.0001649 0.0005811 -0.0002315 0.3545987 -0.1169516 0.0794284 -0.0002578 0.0669448 -0.0107005 0.0003974 -0.0004292 0.0003267 0.050792 1.2650954 -0.23935 -0.0011905 -0.7112726 1.1847287 -0.001909 -0.0014449 -0.0004555 0.130289 1.3892525 -0.0755151 0.0022898 -0.0377138 1.4138245 0.0009661 0.0027824 0.0011751 1.5922789 -0.0360287 0.0414118 0.0348527 -0.0382322 0.0138291 -0.082478 -0.00077 -0.0959854 -0.0394943 -0.0357974 0.0408709 -0.0347521 -0.0386053 0.0144723 0.0823571 0.0010014 0.0961003 -0.0404834 -0.1109821 -0.0635894 -0.0002063 -0.0799816 0.0448201 -0.000011 -0.0002455 0.0000372 0.1238066 0.1151084 -0.0181573 -0.0374465 0.0335409 0.0196878 -0.0936049 -0.0155064 -0.1067383 -0.0494976 0.1149154 -0.0183689 0.0380235 0.033248 0.0205182 0.0933866 0.0159978 0.1063642 -0.0501598 unknown
polarizability: 63.7648145|-4.6084667|51.9816522|0.0074706|-0.0012031|39.9783981 unknown
InChI: InChI=1S/C4H5F3O2/c1-2-9-3(8)4(5,6)7/h2H2,1H3
charge 0 multiplicity 1
14 atoms
F  1.204781 1.656526 0.00668
F  2.157131 -0.066366 1.130047
F  2.140795 -0.057478 -1.144021
O  -1.021234 0.28224 0.004101
O  0.057768 -1.796225 0.003083
C  -2.373452 -0.394483 0.002923
C  -3.412945 0.716256 -0.001244
C  0.062789 -0.551724 0.006229
C  1.381932 0.267198 -0.000092
H  -2.418653 -1.037548 -0.893633
H  -2.421863 -1.033846 0.901952
H  -4.424287 0.271075 -0.002116
H  -3.316187 1.354024 0.892927
H  -3.312975 1.350251 -0.897737
