program: Gaussian 09
title: 000149941
version: EM64L-G09RevD.01
frameworkgroup: C1[X(C11H10O3)]
method: RPBEPBE
basis: SDD
operation: Freq
keyword: #pfreq=noraman
keyword: PBEPBE/SDD
title: #p freq=noraman PBEPBE/SDD
converged: YES YES NO NO
title: Mulliken charges:
elementType: O O O C C C C C C C C C C C H H H H H H H H H H
charge: -0.287315 -0.218756 -0.233799 0.218257 -0.329349 -0.329521 -0.220347 -0.216234 -0.217150 0.198423 0.008314 -0.319509 0.190364 -0.774020 0.271319 0.271391 0.238824 0.235936 0.237295 0.303417 0.244488 0.235571 0.235780 0.256623
chargesum: 0.00000
title: Mulliken charges with hydrogens summed into heavy atoms:
elementType: O O O C C C C C C C C C C C
charge: -0.287315 -0.218756 -0.233799 0.218257 -0.058030 -0.058131 0.018477 0.019702 0.020145 0.198423 0.311730 -0.075021 0.190364 -0.046047
polarizability: 2.37515399e+02 2.87585000e+00 1.33624777e+02 9.09846929e-02 6.98069017e-02 5.56238215e+01
1716.lowfreq: -12.5058 -4.7191 -2.0228 -0.0004 -0.0002 0.0009 29.2759 40.5665 58.9933
frequency: 29.1806 40.5615 58.9925 73.8970 95.4531 144.9241 150.4761 174.4292 245.6829 267.5788 272.8762 386.8231 402.4417 428.0149 438.0761 486.8800 570.3364 599.2582 613.0243 661.0458 673.8797 699.0694 765.0441 794.9370 864.7599 867.6616 912.8824 942.3355 957.7062 969.6456 981.4422 990.0278 998.0478 1011.8804 1023.9520 1028.0437 1084.6284 1091.5174 1176.3501 1183.8603 1187.5318 1230.9029 1264.2908 1309.4433 1318.4810 1365.8598 1391.7959 1439.4007 1442.3214 1455.0145 1477.0418 1573.6403 1585.6347 1610.5830 1653.6522 1656.6568 2978.5962 3061.3868 3125.2700 3134.6829 3145.8404 3147.2973 3149.3381 3158.4225 3170.5984 3184.5723
redmass: 3.9789 5.7310 5.1732 5.3469 1.0623 6.8567 4.3363 3.1664 4.3653 4.0842 6.4205 8.4838 2.8185 3.3174 3.7129 7.6687 2.6123 4.6774 6.4446 6.7827 5.2622 1.6280 8.0747 2.0854 1.2517 1.6191 5.1792 1.7333 1.4130 6.8339 1.1393 6.1692 1.3871 1.3359 1.8286 2.0750 2.0276 2.7040 1.0569 1.2395 1.6212 3.5248 1.2836 2.2981 1.3155 1.2696 9.9207 2.2468 1.0925 1.0501 2.2433 7.4068 6.3035 6.0156 7.4534 9.0591 1.0375 1.0965 1.0993 1.0859 1.0940 1.0892 1.0923 1.0942 1.0987 1.0971
irintensity: 3.1210 0.0147 0.2650 0.0318 0.1356 0.8634 0.4887 1.7824 0.6096 5.1901 20.8604 1.2853 0.0045 3.1419 0.3467 4.4482 0.1729 10.4108 1.9866 9.5870 17.1561 88.9427 92.1803 25.8543 0.5970 11.8328 11.3956 91.0826 2.4299 436.9677 63.5078 0.5493 0.0495 0.4942 5.5013 6.1144 223.9065 418.4247 0.1454 42.7327 24.1051 332.4493 72.1502 74.4274 0.7414 66.1481 3.4478 17.3411 31.8811 20.6200 6.9335 245.7042 9.7463 25.8695 170.2727 269.7204 3.3645 14.8541 16.8994 0.2637 6.5844 7.6317 11.3396 13.3275 21.0252 6.8439
temp: 298.150 k
press: 1.00000 atm
elementType: 8 8 8 6 6 6 6 6 6 6 6 6 6 6 1 1 1 1 1 1 1 1 1 1
symmnumber: 1
zpe: 474773.2 jmol-1
zpe.correction: 0.180832 hartree
zpe.thermalcorrener: 0.194228 hartree
zpe.thermalcorrenthalpy: 0.195172 hartree
zpe.thermalcorrgfe: 0.138692 hartree
zpe.sumelectzpe: -649.825689 hartree
zpe.sumelectthermal: -649.812293 hartree
zpe.sumelectthermalent: -649.811349 hartree
zpe.sumelectthermalfe: -649.867829 hartree
dipole: 3.7939 -4.5997 0.0261
dipole: 5.9625
quadrupole: -71.0975 -80.6833 -83.9918
quadrupole: 12.0734 -0.1128 0.0694
quadrupole: 7.4934 -2.0924 -5.4009 12.0734 -0.1128 0.0694
hfenergy: -650.006521 hartree
pointgroup: C01 [X(C11H10O3)]
dipole: -1.5196441 -1.7855693 -0.0732096 debye
dipolederiv: -2.7649505 0.4700425 0.0784464 0.4854104 -0.5316009 -0.0289413 0.0784975 -0.0283506 -0.1823407 -0.7546194 -0.2190925 -0.0020121 0.2141159 -0.9973518 -0.0410463 0.0213878 -0.0315261 -0.3061837 -0.8983775 -0.0255217 0.0101445 -0.4994025 -0.7638281 -0.0187002 -0.0179669 -0.0277577 -0.321125 -0.7798676 -0.2002042 0.0052467 -0.2365598 -0.134017 -0.0013283 0.0029629 -0.0022227 -0.0187678 0.1646909 0.1724577 0.0031151 -0.1605259 0.039401 0.0098911 -0.0134478 0.003595 -0.1040268 0.0940501 -0.0636157 -0.006458 0.2330436 0.00553 0.0005877 0.0083826 0.0067431 -0.1041813 -0.0195589 -0.2023825 -0.0117955 -0.2691886 -0.1056763 0.0072156 -0.0149813 0.0058438 -0.1509591 -0.2821268 0.0641321 0.0054469 0.1014439 0.1547807 0.0125934 0.0068205 0.0134237 -0.1542546 0.1181794 0.0445344 -0.0022453 0.057107 0.0662867 0.0080103 -0.0018563 0.00814 -0.1240166 2.7640274 0.0498247 -0.0493763 -0.8997445 1.4232598 0.0803124 -0.1003422 0.0603018 0.2624551 1.8418522 -0.2456015 -0.0504404 0.1261662 0.1331909 0.0033509 -0.0323625 0.0104674 0.0468354 -1.5535657 0.1868867 0.036998 0.3847988 -0.0447478 0.0046185 0.0492199 0.0086296 -0.2641524 2.0887624 -0.2545091 -0.0562327 0.2891096 0.8769197 0.0428396 -0.0244783 0.0532179 0.1260733 -0.3175662 0.2465039 0.0234922 0.3835519 -0.3393398 -0.0325532 0.0303268 -0.0286754 0.0546643 0.1368228 -0.0417099 -0.0016618 -0.0047838 -0.0105858 -0.0078151 0.0004023 -0.0072543 0.1578474 0.0590076 0.0750399 0.0051653 0.0988294 0.0555122 -0.0066502 0.0063906 -0.006386 0.1555954 -0.0577429 0.0857219 0.0080612 0.0994111 0.0186603 -0.0085262 0.0086932 -0.0082309 0.1605488 0.0681888 -0.0217027 0.0006879 -0.0557889 -0.1017029 -0.0112359 -0.0010175 -0.0119036 0.1595048 -0.0923623 -0.0704275 0.0012488 -0.074773 0.0679505 -0.0028105 0.0011335 -0.0029131 0.1567836 0.0803163 0.0224004 0.0035622 -0.0848433 0.0697503 -0.0055823 -0.001651 -0.0076358 0.1937013 0.068912 -0.0387469 0.0002663 -0.0567248 -0.0520161 -0.0132268 0.0004899 -0.0136436 0.1886128 0.0686818 -0.0036412 -0.0695041 -0.0194467 0.0627528 -0.0860765 -0.0252994 -0.1051819 -0.0376305 0.0733797 -0.0053782 0.0632866 -0.0166797 0.0391651 0.0959513 0.0180277 0.1142983 -0.0183168 -0.1061338 -0.0250106 0.004558 -0.0945264 0.0677064 -0.000878 0.0006682 -0.0029788 0.1233333 unknown
polarizability: 237.3315747|-4.2430417|133.5160505|-3.8833558|4.1292931|55.9163723 unknown
InChI: InChI=1S/C11H10O3/c1-9(12)7-8-14-11(13)10-5-3-2-4-6-10/h2-8H,1H3
charge 0 multiplicity 1
24 atoms
O  0.540955 -0.136985 -0.005716
O  -0.216431 2.085502 0.126007
O  4.635527 1.031173 -0.015841
C  -1.836567 0.255308 0.063666
C  -2.957802 1.126711 0.12545
C  -2.031446 -1.150445 0.000582
C  -4.262111 0.595255 0.123782
C  -3.340173 -1.675333 -0.000265
C  -4.455638 -0.80612 0.061027
C  -0.489099 0.869943 0.068276
C  1.873125 0.287515 -0.008521
C  2.877341 -0.628121 -0.082183
C  4.300805 -0.190011 -0.085875
C  5.342005 -1.300122 -0.17947
H  -2.784284 2.206798 0.173479
H  -1.162112 -1.811175 -0.04659
H  -5.125565 1.266927 0.171066
H  -3.492521 -2.758671 -0.048389
H  -5.470814 -1.218243 0.060114
H  2.046773 1.368822 0.0509
H  2.650593 -1.698741 -0.140877
H  5.194833 -1.893273 -1.102172
H  5.2431 -1.997702 0.674261
H  6.353606 -0.86691 -0.180912
