program: Gaussian 09
title: 000149940
version: EM64L-G09RevD.01
frameworkgroup: C1[X(C14H10NO6P)]
method: RPBEPBE
basis: SDD
operation: Freq
keyword: #p
keyword: freq=noraman
keyword: PBEPBE/SDD
title: #p freq=noraman PBEPBE/SDD
converged: YES YES NO NO
title: Mulliken charges:
elementType: P O O O O O O N C C C C C C C C C C C C C C H H H H H H H H H H
charge: 1.185935 -0.494162 -0.184317 -0.186230 -0.599012 -0.215876 -0.217644 0.020822 -0.062152 -0.085661 0.365711 -0.297307 -0.287061 -0.249782 -0.247990 -0.299374 -0.339722 -0.157537 -0.154732 0.381244 -0.340693 -0.332517 0.291223 0.291607 0.299766 0.267447 0.265389 0.266092 0.270330 0.270990 0.287145 0.288069
chargesum: 0.00000
title: Mulliken charges with hydrogens summed into heavy atoms:
elementType: P O O O O O O N C C C C C C C C C C C C C C
charge: 1.185935 -0.494162 -0.184317 -0.186230 -0.599012 -0.215876 -0.217644 0.020822 -0.062152 -0.085661 0.365711 -0.006084 0.004546 0.015606 0.018101 0.000391 -0.072275 0.112793 0.116258 0.381244 -0.053548 -0.044448
polarizability: 2.80507576e+02 2.81327139e+01 1.60981703e+02 9.16725997e-01 9.35698342e+00 1.87135243e+02
1716.lowfreq: -6.5803 -3.5520 -0.0015 -0.0012 -0.0012 2.5348 16.7177 25.0515 34.6833
frequency: 16.6632 25.0213 34.6485 38.3653 48.6283 50.0848 73.0938 80.2228 108.0860 142.3740 160.9916 189.9250 223.4467 244.9273 270.3541 275.6548 277.5108 325.1561 376.3661 393.1456 416.1970 464.6358 496.0536 507.5195 539.7706 568.8190 587.3556 588.7927 619.2131 627.1461 634.1461 661.2711 666.7517 734.0882 754.9249 756.3497 772.3263 829.4270 838.9061 843.9779 844.9346 868.3616 869.1525 869.4979 874.0503 878.3473 901.9798 902.9758 984.3611 990.7762 993.2645 999.1041 1000.3302 1019.0511 1024.2968 1028.5831 1093.7541 1106.1518 1122.7405 1126.0754 1143.5274 1151.3817 1166.8891 1202.2283 1203.1423 1210.2808 1224.3007 1291.2646 1349.7776 1353.0600 1355.5925 1397.4039 1429.0152 1441.1918 1446.3108 1472.0922 1534.3919 1539.4051 1588.5874 1602.9104 3152.7550 3171.6107 3184.1706 3190.9525 3229.7006 3230.2127 3244.1579 3244.8449 3271.2319 3271.7356
redmass: 8.1533 5.6002 4.8803 5.5388 5.5688 6.5670 6.7478 8.0146 8.8769 8.4285 6.6286 11.5471 7.1627 7.4486 7.0725 7.8017 7.0547 7.8087 10.2413 10.1899 3.0240 11.0013 3.5712 7.6181 10.7215 9.0985 3.0096 3.0098 6.3765 6.6449 6.0876 9.6323 4.8391 4.9580 1.2540 1.2524 9.7898 6.7862 1.2659 1.2812 1.2808 5.5320 4.0383 2.1107 4.8944 4.9467 1.3657 1.3599 1.3312 2.3026 1.3857 2.9566 1.6118 3.6502 2.9516 2.7206 3.2361 1.2638 1.8758 1.7325 3.5052 5.1917 1.4589 1.5978 1.7244 2.2304 6.4598 1.2808 2.4402 2.5102 7.8625 9.7716 4.1235 6.1997 6.0919 2.4029 5.2782 5.4211 7.8607 6.5818 1.0922 1.0889 1.0949 1.0974 1.0919 1.0918 1.0996 1.0997 1.1091 1.1092
irintensity: 0.5666 0.1575 0.3731 0.1119 2.0111 0.3546 0.1470 2.7756 1.8987 0.7210 5.5995 4.8260 5.5773 11.8342 5.7460 4.8232 2.9543 7.7387 15.3033 6.0780 0.3775 65.7413 58.6205 26.9981 130.0586 83.1274 0.5278 9.2500 8.2523 53.2948 22.4004 216.3826 18.0545 7.2466 43.7087 121.2018 27.9511 220.7475 7.5419 1.3020 28.6454 20.6825 10.6893 63.2547 4.9680 0.5770 0.4468 0.6810 0.9442 89.8264 8.7562 6.0401 64.6871 6.8508 15.5348 13.1873 20.1243 28.9482 29.4931 18.4795 1.2910 9.2613 297.7124 57.4225 145.2424 181.7808 304.6575 0.3551 2.0262 8.5344 90.2889 28.7852 23.4795 16.6627 36.4143 109.6716 11.1856 8.1468 46.5278 208.3787 0.6251 0.5187 0.6870 2.7008 0.7288 0.8899 2.2694 2.9221 0.0189 0.0029
temp: 298.150 k
press: 1.00000 atm
elementType: 15 8 8 8 8 8 8 7 6 6 6 6 6 6 6 6 6 6 6 6 6 6 1 1 1 1 1 1 1 1 1 1
symmnumber: 1
zpe: 568550.7 jmol-1
zpe.correction: 0.216550 hartree
zpe.thermalcorrener: 0.236167 hartree
zpe.thermalcorrenthalpy: 0.237112 hartree
zpe.thermalcorrgfe: 0.164137 hartree
zpe.sumelectzpe: -1385.093510 hartree
zpe.sumelectthermal: -1385.073892 hartree
zpe.sumelectthermalent: -1385.072948 hartree
zpe.sumelectthermalfe: -1385.145923 hartree
dipole: -8.5464 2.0533 -2.2398
dipole: 9.0705
quadrupole: -155.9031 -115.7389 -130.8422
quadrupole: 7.3629 4.3517 0.3463
quadrupole: -21.7417 18.4225 3.3192 7.3629 4.3517 0.3463
hfenergy: -1385.3100599 hartree
pointgroup: C01 [X(C14H10N1O6P1)]
dipole: 3.3754752 0.5231168 1.0331448 debye
polarizability: 278.3010432|-32.0752401|167.0287536|-3.3935892|-13.2511866|183.2947252 unknown
InChI: InChI=1S/C14H10NO6P/c16-15(17)11-5-7-12(8-6-11)21-22(18,13-3-1-9-19-13)14-4-2-10-20-14/h1-10H
charge 0 multiplicity 1
32 atoms
P  1.696683 0.027718 -0.840521
O  0.475902 -1.003698 -0.043381
O  3.473508 -1.153058 0.983778
O  1.551628 1.63147 1.471696
O  1.547732 0.240433 -2.419574
O  -5.656578 0.466424 -1.117348
O  -5.8042 -0.596329 0.896825
N  -5.126978 -0.150481 -0.111342
C  3.171271 -0.923339 -0.373052
C  1.557715 1.60906 0.061199
C  -0.900789 -0.737459 -0.108581
C  4.134266 -1.499449 -1.18685
C  1.426503 2.896034 -0.440059
C  5.092716 -2.128698 -0.306492
C  1.334418 3.776568 0.702434
C  -1.510893 -0.080085 -1.20979
C  -1.673014 -1.212044 0.981454
C  4.661885 -1.899067 0.990883
C  1.413974 2.980295 1.834411
C  -3.664942 -0.356513 -0.112076
C  -2.903329 0.115739 -1.204748
C  -3.064584 -1.025484 0.980673
H  4.144088 -1.47198 -2.274351
H  1.398963 3.164333 -1.4940
H  -0.902419 0.249382 -2.058371
H  -1.16399 -1.716506 1.807043
H  5.982705 -2.679484 -0.602384
H  1.221938 4.858244 0.682155
H  5.03755 -2.167197 1.974421
H  1.3901 3.175215 2.903007
H  -3.410247 0.615875 -2.033984
H  -3.69058 -1.377819 1.804327
