program: Gaussian 09
title: 000149923
version: EM64L-G09RevD.01
frameworkgroup: C1[X(C13H11ClNO4P)]
method: RPBEPBE
basis: SDD
operation: Freq
keyword: #p
keyword: freq=noraman
keyword: PBEPBE/SDD
title: #p freq=noraman PBEPBE/SDD
converged: YES YES NO NO
title: Mulliken charges:
elementType: Cl P O O O O N C C C C C C C C C C C C C H H H H H H H H H H H
charge: -0.026345 1.113950 -0.527022 -0.617313 -0.214655 -0.217908 0.021171 -0.167025 -0.856189 -0.237254 -0.272060 0.379896 -0.193794 -0.183918 -0.308187 -0.353447 -0.101984 0.381429 -0.338409 -0.334269 0.269608 0.292528 0.260942 0.259825 0.293343 0.266926 0.268504 0.306588 0.259241 0.287567 0.288262
chargesum: 0.00000
title: Mulliken charges with hydrogens summed into heavy atoms:
elementType: Cl P O O O O N C C C C C C C C C C C C C
charge: -0.026345 1.113950 -0.527022 -0.617313 -0.214655 -0.217908 0.021171 -0.167025 -0.033111 0.022571 0.021283 0.379896 0.073132 0.084586 -0.001599 -0.094206 -0.101984 0.381429 -0.050842 -0.046007
polarizability: 2.34518951e+02 -1.22148528e+01 1.92779377e+02 -6.28521655e-01 -8.36662655e-01 1.81174882e+02
1716.lowfreq: -5.9368 -0.0015 0.0017 0.0018 5.1833 5.6641 11.8587 21.8882 35.5718
frequency: 11.7029 21.8274 35.5685 60.8178 71.8332 87.5592 90.3026 116.5781 130.1691 159.3685 185.5708 198.3529 214.7405 247.8137 260.1132 289.0281 309.2506 343.5999 357.6186 379.9737 404.0636 416.3842 435.4581 490.0283 498.4165 504.8166 510.6960 556.0985 618.6971 624.4804 657.9659 666.4388 693.2988 716.1538 734.1632 738.1108 775.2214 829.9080 833.6829 837.1624 847.1524 869.0008 923.0927 949.1266 960.8761 983.4960 984.6292 994.7984 998.0021 998.5951 1028.7397 1069.3917 1093.0043 1095.4185 1108.1619 1111.3839 1169.1635 1186.5192 1214.9873 1224.6382 1291.6409 1293.2042 1336.6875 1354.9689 1364.5216 1388.7020 1396.2839 1430.4202 1430.9296 1438.3285 1462.1271 1474.5251 1577.9906 1582.7060 1588.8235 1604.0284 3022.4524 3142.6712 3144.6039 3147.4476 3148.0990 3155.2485 3167.1709 3175.6283 3178.5601 3184.0008 3188.5833
redmass: 13.7351 5.3287 3.9880 7.8261 6.9828 7.6387 6.8181 4.9652 1.1082 3.7923 9.1511 6.0156 7.0085 9.1536 6.9371 6.2515 7.2161 7.0971 6.5593 7.2039 2.9183 3.0381 8.0950 5.1395 4.4751 4.0239 5.1797 7.0901 7.1113 7.5100 9.3306 4.8033 6.2873 4.3837 4.9268 6.0882 9.9000 1.4003 5.9156 1.2927 1.3017 1.5856 1.5468 1.3615 1.3525 1.3285 1.3505 1.3749 4.4206 3.0365 4.8704 4.0105 2.7120 3.1536 1.2691 1.3912 1.4397 1.1425 3.3799 6.2512 1.2444 1.2814 1.1718 7.8747 4.4640 4.1805 9.6610 1.3471 2.1834 1.0510 2.1504 2.4039 7.6183 6.0526 7.9297 6.5107 1.0314 1.0902 1.1020 1.0907 1.1020 1.0923 1.0890 1.0956 1.0966 1.0950 1.0972
irintensity: 0.3045 0.0629 0.2120 1.1045 0.0555 2.4918 4.8922 1.6360 0.4516 2.2072 6.6121 2.5655 2.9566 1.2195 5.9206 2.2831 1.7858 15.8943 33.0815 40.2661 0.9233 0.1900 32.1546 6.6041 11.2788 28.1821 62.9848 18.0594 0.4717 24.2273 85.9395 19.8033 67.7676 19.9429 5.3742 90.2516 19.3741 65.4026 199.0160 15.1541 8.3423 82.0067 10.7000 126.7483 2.1522 0.4941 0.1330 2.4642 27.7090 4.7913 76.7068 87.7230 42.1884 18.9988 19.8604 11.5042 269.0859 11.4779 388.5930 248.9265 2.0792 0.0235 23.1122 84.8015 7.4909 14.5249 31.6471 11.2027 15.2249 19.0511 45.7456 117.3964 4.8071 63.3105 39.4626 217.8692 0.6059 1.5594 1.8755 1.0364 2.2418 2.2065 1.6603 1.2884 1.5812 0.5643 3.5107
temp: 298.150 k
press: 1.00000 atm
elementType: 17 15 8 8 8 8 7 6 6 6 6 6 6 6 6 6 6 6 6 6 1 1 1 1 1 1 1 1 1 1 1
symmnumber: 1
zpe: 565795.2 jmol-1
zpe.correction: 0.215500 hartree
zpe.thermalcorrener: 0.234689 hartree
zpe.thermalcorrenthalpy: 0.235634 hartree
zpe.thermalcorrgfe: 0.164416 hartree
zpe.sumelectzpe: -1657.401825 hartree
zpe.sumelectthermal: -1657.382636 hartree
zpe.sumelectthermalent: -1657.381692 hartree
zpe.sumelectthermalfe: -1657.452909 hartree
dipole: -6.9873 3.3104 -3.4213
dipole: 8.4550
quadrupole: -160.5842 -135.7000 -124.2409
quadrupole: 8.1860 -2.9611 -7.5464
quadrupole: -20.4092 4.4751 15.9341 8.1860 -2.9611 -7.5464
hfenergy: -1657.6173253 hartree
pointgroup: C01 [X(C13H11Cl1N1O4P1)]
dipole: 2.9035997 -0.9195181 -1.3374838 debye
polarizability: 237.251046|-5.2708201|190.1169227|0.1645424|0.6045653|181.1052416 unknown
InChI: InChI=1S/C13H11ClNO4P/c1-20(18,13-8-2-10(14)3-9-13)19-12-6-4-11(5-7-12)15(16)17/h2-9H,1H3
charge 0 multiplicity 1
31 atoms
Cl 4.480044 3.787841 -0.303566
P  1.617733 -1.974699 0.323712
O  0.186786 -1.858786 -0.754649
O  1.337809 -2.314756 1.863384
O  -5.002974 1.153135 1.469522
O  -5.410796 1.165277 -0.776312
N  -4.681444 0.866417 0.249988
C  2.42534 -0.31885 0.097874
C  2.480931 -3.284058 -0.667947
C  2.568355 0.270762 -1.180494
C  2.896577 0.343791 1.255615
C  -0.994168 -1.174834 -0.433641
C  3.19531 1.528805 -1.307331
C  3.524674 1.602604 1.13778
C  -1.383212 -0.866018 0.897627
C  -1.819886 -0.828355 -1.534231
C  3.667618 2.171202 -0.143739
C  -3.408014 0.158179 0.014074
C  -2.596201 -0.189409 1.117176
C  -3.034588 -0.160642 -1.312633
H  3.472709 -3.468314 -0.22617
H  1.876005 -4.202445 -0.621791
H  2.583569 -2.958186 -1.713903
H  2.176684 -0.22699 -2.074442
H  2.762662 -0.122004 2.238221
H  3.309806 2.00201 -2.286444
H  3.893358 2.129012 2.022299
H  -0.753133 -1.17006 1.739222
H  -1.493753 -1.092897 -2.543957
H  -2.928397 0.06527 2.126964
H  -3.693005 0.121197 -2.138206
