program: Gaussian 09
title: 000149997
version: EM64L-G09RevD.01
frameworkgroup: C1[X(C23H21N3O4)]
method: RPBEPBE
basis: SDD
operation: Freq
keyword: #p
keyword: freq=noraman
keyword: PBEPBE/SDD
title: #p freq=noraman PBEPBE/SDD
converged: YES YES NO NO
title: Mulliken charges:
elementType: O O O O N N N C C C C C C C C C C C C C C C C C C C C C C C H H H H H H H H H H H H H H H H H H H H H
charge: -0.258588 -0.242695 -0.265880 -0.266820 -0.214780 0.021189 -0.004573 0.223979 -0.356601 -0.096105 0.035189 -0.497286 0.142543 0.312813 0.335476 -0.374252 -0.394755 -0.400644 -0.375318 0.303564 -0.224380 -0.229419 -0.248213 -0.230853 -0.216241 -0.235756 -0.241029 -0.257868 -0.258089 -0.497167 0.266811 0.275368 0.251395 0.240078 0.258733 0.260531 0.296908 0.252221 0.233875 0.235598 0.233977 0.230361 0.234706 0.230509 0.258297 0.220773 0.202556 0.187583 0.238013 0.200068 0.204199
chargesum: 0.00000
title: Mulliken charges with hydrogens summed into heavy atoms:
elementType: O O O O N N N C C C C C C C C C C C C C C C C C C C C C C C
charge: -0.258588 -0.242695 -0.265880 -0.266820 -0.214780 0.021189 -0.004573 0.223979 0.185579 -0.096105 0.035189 -0.005813 0.142543 0.312813 0.335476 -0.115519 -0.134223 -0.103736 -0.123097 0.303564 0.009495 0.006179 -0.014236 -0.000493 -0.216241 -0.001050 -0.010520 0.221202 0.132050 0.145113
polarizability: 3.37186333e+02 -5.71481646e+00 3.35110087e+02 -2.66804700e+01 -1.80295201e+01 1.99876799e+02
1716.lowfreq: -5.9598 -2.4760 -0.0008 -0.0006 0.0005 5.1094 11.0169 14.2517 27.6964
frequency: 9.8189 14.0841 27.6652 33.1376 43.1313 54.9212 57.2251 66.5220 68.1263 74.2856 77.9010 82.3725 104.1811 115.0975 136.9430 153.9475 172.8755 190.4478 211.2856 221.2985 236.4488 245.0161 259.5499 268.1843 286.7974 300.9138 312.3070 352.1937 374.7021 400.2909 406.3647 408.3843 422.0886 435.3179 458.8126 471.3203 490.9711 501.4012 538.1293 566.0846 581.6474 597.7265 612.8846 618.1047 633.6406 653.3322 674.9544 687.6696 694.9721 702.7529 707.0156 754.0188 771.1143 780.7767 788.7612 804.1280 810.9371 854.6523 859.4137 866.8456 905.2008 916.6678 930.2712 935.6621 961.7244 975.7723 980.0329 985.6288 988.5614 989.6251 995.9008 1000.4336 1003.3568 1022.2207 1024.6086 1030.1263 1050.2746 1064.3793 1073.8268 1087.7082 1089.6675 1108.1458 1121.6851 1122.9133 1157.7188 1170.4319 1174.6629 1176.7314 1189.5998 1195.6036 1198.3606 1202.0689 1230.0378 1248.3829 1253.0468 1289.2078 1307.8146 1317.2909 1325.2910 1330.8468 1351.7911 1363.1849 1371.2048 1375.2326 1380.0680 1389.7741 1416.8471 1432.7126 1437.8212 1441.5102 1447.1989 1454.4935 1458.2158 1459.8336 1465.3099 1477.5878 1480.9604 1489.7847 1522.7916 1583.5906 1585.2206 1604.6984 1609.7987 1612.1479 1638.5557 2177.7500 2917.3074 2927.4705 2974.0146 2997.8482 3017.6604 3019.0276 3042.7799 3086.4739 3101.5010 3107.4527 3118.0015 3126.7542 3131.5938 3136.2260 3138.2036 3147.2883 3148.2666 3155.5338 3158.4646 3167.3010 3171.1327
redmass: 5.2770 4.9367 5.6913 4.3164 4.6636 4.7367 4.2896 4.7060 4.4905 4.4695 5.7738 4.6131 6.3001 4.4538 6.2841 5.1266 4.8256 3.7480 4.5960 1.5320 7.1533 5.3255 3.4882 2.3889 5.2794 3.0653 6.9393 3.6609 4.0931 3.0898 3.0696 4.6394 3.7599 5.3487 8.4276 7.5502 3.0006 3.8729 4.5336 7.4386 4.3218 8.4226 6.4554 6.6257 5.9689 3.0432 6.2338 7.0042 7.0120 1.8112 1.7124 2.5015 2.2405 2.9087 4.2179 3.5539 5.1169 1.2433 1.2457 3.8301 4.9336 5.4855 1.4056 1.4294 2.9834 2.6614 1.4327 1.5094 5.8496 4.0812 2.6322 1.3248 1.3169 2.9392 2.6727 2.1543 2.7699 2.6064 2.5172 1.6783 1.7424 1.7185 1.9119 2.8514 1.4347 2.2211 1.0850 1.0557 4.0888 1.1169 1.1294 1.1321 2.2787 3.4704 1.1706 1.5928 4.6578 1.4791 1.3949 1.2647 1.3330 2.3478 1.9800 6.3532 5.3299 1.4822 3.6913 2.2933 1.1661 1.0899 2.9081 1.0810 1.0527 1.0742 1.2015 1.0675 2.3002 2.4987 8.4280 5.9202 6.0033 9.2051 6.1843 6.6466 10.2635 12.6361 1.0507 1.0412 1.1012 1.1027 1.0589 1.0625 1.0608 1.1070 1.0993 1.0969 1.1045 1.0849 1.0850 1.0883 1.0880 1.0930 1.0926 1.0967 1.0969 1.1015 1.1018
irintensity: 0.0928 0.8585 0.8624 1.3270 0.7659 0.4965 0.1974 2.0397 2.3944 4.0147 1.9374 1.7207 3.8993 0.2193 2.1606 0.7667 3.7314 2.3382 4.1900 2.9271 3.0579 3.5105 0.6618 6.6738 2.5408 2.5316 0.3204 7.1206 3.2293 0.3220 0.5200 7.3692 7.4899 12.8033 3.6168 5.6290 10.2796 0.6919 9.9196 3.1130 1.3996 5.6016 0.5033 0.5407 4.1421 9.0618 7.3475 6.7069 7.1636 32.5307 92.3208 22.8871 56.0743 4.9810 10.0579 13.2045 3.4361 1.5988 2.1832 7.1331 5.1372 12.5276 0.8050 4.3774 32.6936 62.5994 0.4421 0.4561 1.4264 2.9519 28.1432 0.1741 4.2652 76.5783 23.4320 10.7124 4.2052 93.8470 33.9692 17.9135 27.9082 15.5204 11.8242 33.4668 15.2036 35.4357 1.7249 0.2929 129.0745 3.9120 3.6652 8.8273 130.5826 6.4984 5.9867 45.7733 3.0646 4.6072 5.5704 27.8641 8.0756 29.0254 1.4757 5.2221 6.3133 7.6113 50.6673 20.1583 0.4847 19.6444 16.9036 9.1899 10.6853 17.3318 32.1501 6.6338 10.9488 3.5851 14.3214 5.5987 6.0085 292.4205 13.0521 69.4097 179.9271 4.0596 47.2103 122.2061 46.6425 62.4729 20.8050 11.4450 8.1350 17.3734 11.8057 24.9109 3.2350 1.2429 0.2897 9.2993 0.6823 14.8839 14.6288 15.9542 21.8406 25.8181 18.2591
temp: 298.150 k
press: 1.00000 atm
elementType: 8 8 8 8 7 7 7 6 6 6 6 6 6 6 6 6 6 6 6 6 6 6 6 6 6 6 6 6 6 6 1 1 1 1 1 1 1 1 1 1 1 1 1 1 1 1 1 1 1 1 1
symmnumber: 1
zpe: 1029122.0 jmol-1
zpe.correction: 0.391972 hartree
zpe.thermalcorrener: 0.419918 hartree
zpe.thermalcorrenthalpy: 0.420862 hartree
zpe.thermalcorrgfe: 0.328997 hartree
zpe.sumelectzpe: -1352.017854 hartree
zpe.sumelectthermal: -1351.989908 hartree
zpe.sumelectthermalent: -1351.988964 hartree
zpe.sumelectthermalfe: -1352.080829 hartree
dipole: 4.7117 6.3975 0.6956
dipole: 7.9757
quadrupole: -143.7902 -186.1673 -171.3869
quadrupole: -24.0477 2.0464 3.6290
quadrupole: 23.3246 -19.0525 -4.2721 -24.0477 2.0464 3.6290
hfenergy: -1352.4098263 hartree
pointgroup: C01 [X(C23H21N3O4)]
dipole: -1.6769239 2.6338474 0.3116142 debye
polarizability: 337.2438543|11.4036237|320.2374955|-25.4267514|45.5635525|214.6918696 unknown
InChI: InChI=1S/C23H21N3O4/c1-29-14-15-30-20(27)12-13-26-23(28)19(16-24)21(17-8-4-2-5-9-17)22(25-26)18-10-6-3-7-11-18/h2-11H,12-15H2,1H3
charge 0 multiplicity 1
51 atoms
O  -4.023029 -0.493714 0.541378
O  0.19682 -3.872546 -1.289762
O  -2.710518 -0.514572 2.469904
O  -5.083989 1.438649 -1.446233
N  -0.748814 -1.869035 -0.496558
N  -0.68656 -0.561739 -0.111798
N  3.739407 -3.454345 -1.415877
C  1.748637 -0.627745 -0.409094
C  -2.111604 -2.458062 -0.484558
C  0.509176 0.062559 -0.071344
C  1.649827 -1.965679 -0.831424
C  -2.73006 -2.462387 0.933406
C  0.359482 -2.674596 -0.917069
C  3.080149 0.026486 -0.244082
C  0.427898 1.500605 0.327067
C  3.432713 0.623047 0.997152
C  4.025094 0.029936 -1.304172
C  -0.422252 1.876169 1.401911
C  1.134727 2.507814 -0.381454
C  -3.112062 -1.072031 1.422312
C  4.705951 1.202216 1.173212
C  5.291917 0.626646 -1.130659
C  -0.5465 3.233387 1.769089
C  1.000381 3.864077 -0.01622
C  2.800796 -2.763923 -1.146992
C  5.638344 1.211099 0.109116
C  0.164079 4.232468 1.063265
C  -4.406743 0.918674 0.813239
C  -5.58247 1.260166 -0.083622
C  -6.160226 1.70956 -2.396589
H  -1.999729 -3.485478 -0.863732
H  -2.750804 -1.87376 -1.167408
H  -2.042764 -2.917528 1.664539
H  -3.64778 -3.078114 0.889018
H  2.714637 0.622935 1.823644
H  3.766513 -0.422311 -2.267684
H  -0.978177 1.104754 1.94582
H  1.779393 2.236587 -1.223449
H  4.969187 1.646942 2.138795
H  6.007906 0.626978 -1.959248
H  -1.194666 3.508345 2.608634
H  1.546194 4.631757 -0.575525
H  6.625343 1.666324 0.246157
H  0.066834 5.285656 1.349709
H  -3.538257 1.563508 0.590548
H  -4.671387 1.017613 1.881757
H  -6.343746 0.450317 -0.041396
H  -6.052493 2.202687 0.280873
H  -5.679053 1.828649 -3.37966
H  -6.708966 2.64196 -2.140717
H  -6.885853 0.869394 -2.441421
