program: Gaussian 09
title: 000149901
version: EM64L-G09RevD.01
frameworkgroup: C1[X(C13H13N3O4S)]
method: RPBEPBE
basis: SDD
operation: Freq
keyword: #p
keyword: freq=noraman
keyword: PBEPBE/SDD
title: #p freq=noraman PBEPBE/SDD
converged: NO NO NO NO
title: Mulliken charges:
elementType: S O O O O N N N C C C C C C C C C C C C C H H H H H H H H H H H H H
charge: 0.929757 -0.550644 -0.494587 -0.422776 -0.247842 -0.571120 -0.448311 -0.033919 -0.069873 -0.168474 -0.244482 0.509111 -0.340820 -0.431645 0.216778 -0.279511 -0.241917 0.223080 0.300617 -0.459682 -0.788907 0.299056 0.293796 0.316850 0.316917 0.231175 0.311092 0.235529 0.264626 0.236531 0.253078 0.269804 0.223606 0.363105
chargesum: 0.00000
title: Mulliken charges with hydrogens summed into heavy atoms:
elementType: S O O O O N N N C C C C C C C C C C C C C
charge: 0.929757 -0.550644 -0.494587 -0.059671 -0.247842 -0.254270 -0.137219 -0.033919 -0.069873 0.130583 0.049314 0.509111 -0.023903 -0.200470 0.216778 -0.043981 0.022709 0.223080 0.300617 -0.223151 -0.042419
polarizability: 3.19388946e+02 1.41327910e+01 2.39078374e+02 -1.34313744e+00 -2.33327106e+01 1.18259833e+02
1716.lowfreq: -10.7468 -5.9399 0.0014 0.0014 0.0016 0.9221 7.7358 9.9803 26.0973
frequency: -10.3563 7.7792 26.0486 43.2916 53.4806 68.3746 71.7095 92.4183 111.6221 143.9645 169.2030 179.9181 189.8704 209.3060 239.6900 291.3917 325.9652 345.2580 356.3462 368.3414 371.2388 383.0939 410.1719 413.0034 424.9248 440.2535 469.6184 503.4274 525.7473 533.7776 553.6979 586.7961 618.9118 630.3034 653.1743 672.2841 726.0779 738.7091 747.8969 787.4796 804.6795 819.1553 825.4895 834.8954 850.4054 861.6721 879.5936 928.0771 944.8854 951.0027 967.8875 983.5156 990.5350 991.4202 993.8108 1035.0764 1053.5022 1116.6186 1123.1275 1145.5122 1184.9664 1200.7853 1215.1814 1262.7670 1266.4090 1277.6082 1302.7009 1323.5951 1351.6747 1370.1792 1381.8689 1392.8220 1405.2725 1446.7590 1463.2513 1469.0786 1476.9766 1503.7687 1559.1833 1594.6941 1597.9967 1599.1579 1638.0670 2990.3786 3077.2877 3096.9868 3123.9684 3131.5924 3146.0980 3157.8004 3165.2626 3178.4272 3198.1756 3414.1494 3524.8299 3578.3395
redmass: 1.2178 2.8183 7.0182 4.4002 5.6850 7.2870 4.9614 6.4594 6.5186 8.2155 5.3747 7.5360 11.3631 7.6465 8.7151 6.5088 6.7575 5.8290 4.2950 2.0694 1.6484 5.4154 2.9969 6.7039 4.2886 6.6074 2.6289 4.1570 2.8295 3.7508 4.6541 3.0634 6.9726 5.8904 1.1858 5.8792 3.2550 2.8556 5.3243 3.2506 8.3256 4.5761 1.5471 1.3741 5.5100 1.5279 1.4652 6.6208 13.0485 1.3571 1.3427 2.8939 2.7694 2.3331 1.3843 1.6612 2.3734 1.4023 1.3314 1.3369 1.1320 1.3923 3.4518 1.8617 2.3836 3.4897 1.4197 1.4295 4.5851 4.1974 1.2255 2.6229 4.6165 1.1028 2.6632 1.0922 2.1661 2.0761 5.6111 6.3603 6.1517 5.7505 5.1271 1.0382 1.0984 1.0913 1.0902 1.0981 1.0905 1.0924 1.0950 1.0970 1.0949 1.0759 1.0765 1.0661
irintensity: 1.7468 2.8707 0.8842 0.9655 0.2349 0.9241 8.4972 0.6593 2.7289 1.2495 10.6654 1.6316 3.5288 8.3127 7.3770 11.1726 12.7598 42.9436 15.0345 80.8327 98.3507 15.9169 0.3402 13.6763 0.6487 78.8505 40.5409 16.3995 52.6257 15.7985 79.3719 1.3001 6.5502 7.8797 58.4673 3.5670 2.8740 188.1233 22.7114 20.2450 90.8147 16.1660 64.3833 28.5039 4.9433 66.9333 12.1379 6.5724 61.5659 1.0226 0.5925 14.7604 0.7857 16.6550 2.9145 13.1916 46.2155 52.0979 2.0008 238.4430 44.6164 5.6748 68.4521 59.4124 51.5083 23.9754 44.0745 1.4780 11.3527 210.6589 60.7306 162.7345 21.7034 32.4870 159.1983 13.3264 84.4286 402.7530 3.8508 101.3470 25.3913 14.5691 107.7580 8.0586 15.3435 33.4020 15.9765 6.7237 6.0484 21.2886 11.2498 5.8309 7.5061 21.1848 15.2848 68.9769
temp: 298.150 k
press: 1.00000 atm
elementType: 16 8 8 8 8 7 7 7 6 6 6 6 6 6 6 6 6 6 6 6 6 1 1 1 1 1 1 1 1 1 1 1 1 1
symmnumber: 1
zpe: 643910.9 jmol-1
zpe.correction: 0.245253 hartree
zpe.thermalcorrener: 0.265098 hartree
zpe.thermalcorrenthalpy: 0.266042 hartree
zpe.thermalcorrgfe: 0.193707 hartree
zpe.sumelectzpe: -1364.709612 hartree
zpe.sumelectthermal: -1364.689767 hartree
zpe.sumelectthermalent: -1364.688823 hartree
zpe.sumelectthermalfe: -1364.761158 hartree
dipole: 3.5911 -1.9142 -3.5023
dipole: 5.3690
quadrupole: -85.6569 -136.2525 -135.0978
quadrupole: 15.5907 -3.2382 -11.1892
quadrupole: 33.3455 -17.2501 -16.0954 15.5907 -3.2382 -11.1892
hfenergy: -1364.9548646 hartree
pointgroup: C01 [X(C13H13N3O4S1)]
dipole: -1.6483312 -0.733426 1.098668 debye
polarizability: 310.206933|-32.1780995|233.6901682|16.1776778|42.2345411|132.8300523 unknown
InChI: InChI=1S/C13H13N3O4S/c1-9(17)15-10-2-5-12(6-3-10)21(19,20)16-13-7-4-11(18)8-14-13/h2-8,15-16,18H,1H3
charge 0 multiplicity 1
34 atoms
S  1.322704 1.864502 0.162438
O  1.433224 3.292555 0.946381
O  1.988592 1.661919 -1.304048
O  4.584929 -4.011077 -0.419917
O  -4.703405 -1.579332 -1.092182
N  2.0963 0.638804 1.433408
N  -4.592343 0.474996 0.04234
N  2.099851 -1.270684 0.038334
C  -0.487625 1.372682 0.135055
C  -0.874158 0.18248 -0.500083
C  -1.394082 2.259806 0.738039
C  -3.19619 0.735995 0.050706
C  -2.245281 -0.141674 -0.543778
C  -2.761338 1.932393 0.687951
C  2.781923 -0.489303 0.929761
C  4.091639 -0.827398 1.381882
C  4.681411 -2.024766 0.94208
C  -5.277236 -0.625996 -0.494383
C  3.973522 -2.832377 0.021127
C  2.693239 -2.403322 -0.413642
C  -6.787483 -0.585995 -0.262545
H  -0.117362 -0.48791 -0.919232
H  -1.036202 3.176433 1.217078
H  2.641215 1.239882 2.07614
H  -2.589933 -1.058215 -1.024417
H  -3.492726 2.609792 1.145833
H  -5.173242 1.183168 0.498079
H  4.630903 -0.167406 2.069281
H  5.677279 -2.328386 1.27653
H  2.125384 -2.991345 -1.14883
H  -7.026396 -0.984982 0.741084
H  -7.273855 -1.230523 -1.009234
H  -7.205375 0.4341 -0.338062
H  4.022518 -4.482915 -1.083677
