program: Gaussian 09
title: 000101247
version: EM64L-G09RevD.01
frameworkgroup: C1[X(C11H16N2O6)]
method: RPBEPBE
basis: SDD
operation: Freq
keyword: #p
keyword: freq=noraman
keyword: PBEPBE/SDD
title: #p freq=noraman PBEPBE/SDD
converged: YES YES NO NO
title: Mulliken charges:
elementType: O O O O O O N N C C C C C C C C C C C H H H H H H H H H H H H H H H H
charge: -0.278887 -0.430981 -0.435979 -0.451302 -0.266761 -0.242882 -0.195651 -0.402970 -0.092882 -0.213040 -0.430264 -0.005132 0.020168 -0.390396 -0.220380 0.209754 0.229098 0.095671 -0.763759 0.193488 0.265035 0.238237 0.250712 0.273671 0.215759 0.213024 0.224641 0.356741 0.338067 0.277279 0.360500 0.352294 0.248007 0.211097 0.248026
chargesum: 0.00000
title: Mulliken charges with hydrogens summed into heavy atoms:
elementType: O O O O O O N N C C C C C C C C C C C
charge: -0.278887 -0.074240 -0.097912 -0.099008 -0.266761 -0.242882 -0.195651 -0.042470 0.100605 0.051995 0.058685 0.268539 0.235927 0.047269 0.056899 0.209754 0.229098 0.095671 -0.056629
polarizability: 2.04552973e+02 -6.64081441e+00 1.21043866e+02 8.94013615e+00 -1.01657913e+01 1.39122354e+02
1716.lowfreq: -5.5642 -0.0008 -0.0008 -0.0006 2.5161 7.7565 23.6507 37.5935 50.9617
frequency: 23.3359 37.5634 50.9543 60.9218 89.2355 92.7220 106.3165 144.0800 166.5701 178.0886 190.7078 218.7900 227.6126 236.0003 256.0368 278.6292 293.4580 331.2462 343.2194 358.1552 379.1388 394.1661 419.1859 440.7171 462.3598 472.9130 510.7211 523.6151 529.8276 569.5416 595.7325 636.5124 700.5070 717.3305 722.6662 758.6975 780.7329 819.7153 864.2295 881.7834 892.9988 929.1930 965.6027 986.2607 997.8188 1013.0675 1044.1155 1045.1554 1048.6953 1051.3606 1058.6217 1093.1642 1110.3356 1131.3369 1140.2787 1170.1249 1184.8103 1214.6579 1228.6660 1234.2942 1243.6280 1254.4910 1267.5097 1290.0510 1313.8753 1329.9454 1341.3138 1347.3309 1356.5183 1363.9431 1368.0637 1379.3989 1388.3162 1405.9802 1417.0233 1427.3867 1449.4188 1457.7274 1465.1698 1472.2683 1619.3024 1639.9040 1669.2238 2895.4376 2930.0037 2964.0204 2988.0848 3005.5084 3016.5796 3024.2504 3062.0443 3069.0850 3083.6609 3096.4173 3179.4345 3523.7843 3525.6851 3527.5065 3583.3742
redmass: 5.2990 6.8647 5.4480 5.2736 5.6842 1.4897 2.0332 4.1826 3.8111 2.3960 1.7362 7.3375 3.8421 3.2233 3.8629 3.6313 5.3774 2.5016 1.2853 4.8164 9.7315 6.0750 3.4279 4.0776 3.5499 1.2928 3.2212 4.6279 3.4982 3.9495 4.9257 4.0681 2.4793 4.3433 5.4098 6.7957 2.1930 2.7127 2.9387 2.7302 1.4222 3.3345 4.9897 3.7419 2.8699 1.9329 2.6124 2.4653 2.2744 1.7046 3.1472 2.9624 2.1220 2.6839 4.3640 1.4023 1.2990 1.2432 4.3858 1.1718 1.2493 1.3536 1.6181 1.2605 1.6138 1.4396 1.8339 1.3752 1.3972 1.2357 1.6309 1.8827 1.6773 1.2609 1.5870 2.5338 1.0435 1.0920 1.0795 1.0802 6.1538 9.0132 6.1696 1.0822 1.0823 1.0554 1.0362 1.0818 1.0633 1.1073 1.0859 1.0975 1.1030 1.1005 1.0936 1.0653 1.0769 1.0657 1.0667
irintensity: 1.9532 0.9481 0.2256 3.0529 3.8325 0.5222 1.0262 3.6173 26.9264 56.9803 78.6111 5.0478 17.7241 3.6150 7.0479 6.6017 11.9474 33.6474 43.3343 1.6160 16.7680 1.6885 6.7017 13.8248 42.7952 158.5440 9.9407 9.8695 16.1676 42.9830 32.6177 10.4962 5.6199 6.5715 1.1228 18.6783 114.8878 3.6126 16.4676 33.8562 6.1507 45.8831 90.5481 85.5880 107.6314 37.2190 39.9942 34.5442 88.5896 12.4142 33.8438 1.9039 1.9496 37.5699 20.4953 8.9160 32.7002 16.6741 14.0845 24.8712 32.0191 61.5005 96.1922 69.3061 82.4010 18.5227 71.8476 13.8593 12.7403 54.7373 18.0345 19.5660 13.1129 19.4411 9.9535 57.1488 11.7382 7.1558 10.9580 3.6534 210.0410 281.1899 559.4174 46.3209 33.5104 40.2267 22.2488 2.1548 18.0876 34.1255 15.6155 13.2614 14.5470 14.6695 2.9830 18.9194 59.4317 5.4499 5.7067
temp: 298.150 k
press: 1.00000 atm
elementType: 8 8 8 8 8 8 7 7 6 6 6 6 6 6 6 6 6 6 6 1 1 1 1 1 1 1 1 1 1 1 1 1 1 1 1
symmnumber: 1
zpe: 718638.4 jmol-1
zpe.correction: 0.273715 hartree
zpe.thermalcorrener: 0.292900 hartree
zpe.thermalcorrenthalpy: 0.293844 hartree
zpe.thermalcorrgfe: 0.225353 hartree
zpe.sumelectzpe: -988.157642 hartree
zpe.sumelectthermal: -988.138456 hartree
zpe.sumelectthermalent: -988.137512 hartree
zpe.sumelectthermalfe: -988.206003 hartree
dipole: 5.0455 1.6778 -2.1310
dipole: 5.7283
quadrupole: -125.3788 -109.7717 -115.1997
quadrupole: 5.5520 5.8493 -6.4366
quadrupole: -8.5954 7.0117 1.5837 5.5520 5.8493 -6.4366
hfenergy: -988.4313565 hartree
pointgroup: C01 [X(C11H16N2O6)]
dipole: 2.0021744 -0.8677768 0.5632894 debye
polarizability: 204.1406218|9.0343824|128.3990899|-8.1338372|-13.7224515|132.1794805 unknown
InChI: InChI=1S/C11H16N2O6/c1-5-3-13(11(18)12-10(5)17)8-2-6(15)9(16)7(4-14)19-8/h3,6-9,12,14-16H,2,4H2,1H3
charge 0 multiplicity 1
35 atoms
O  1.05475 -0.8454 -0.313084
O  3.080771 2.283464 1.644442
O  4.64432 0.198786 0.316163
O  2.88321 -2.731056 -1.943605
O  -1.431534 1.566202 -2.186567
O  -5.062825 -0.312527 0.082018
N  -1.006457 0.288739 -0.247569
N  -3.212655 0.596836 -1.012253
C  2.55295 1.493799 0.534537
C  3.183802 0.086815 0.515063
C  1.027828 1.418512 0.696256
C  0.441622 0.496219 -0.391897
C  2.513347 -0.800928 -0.56165
C  3.019027 -2.239485 -0.565442
C  -1.504865 -0.487309 0.804406
C  -1.855958 0.865769 -1.225974
C  -2.843089 -0.737098 0.992291
C  -3.806847 -0.168967 0.036367
C  -3.38082 -1.580269 2.121449
H  2.797299 1.984612 -0.439709
H  3.088326 -0.372951 1.514471
H  0.79342 1.026376 1.703199
H  0.592634 2.429872 0.612666
H  0.593205 0.930969 -1.399727
H  2.700667 -0.364807 -1.571151
H  2.409029 -2.830591 0.14776
H  4.080831 -2.253459 -0.245542
H  4.068708 2.176133 1.641369
H  4.824448 0.481201 -0.61902
H  -0.741101 -0.913717 1.458488
H  -3.856756 1.002597 -1.698819
H  3.003637 -3.712658 -1.963619
H  -4.099538 -1.003979 2.731634
H  -2.569648 -1.94241 2.775862
H  -3.935541 -2.45169 1.728787
