program: Gaussian 09
title: 000101186
version: EM64L-G09RevD.01
frameworkgroup: C1[X(C11H13NO4)]
method: RPBEPBE
basis: SDD
operation: Freq
keyword: #p
keyword: freq=noraman
keyword: PBEPBE/SDD
title: #p freq=noraman PBEPBE/SDD
converged: YES YES NO NO
title: Mulliken charges:
elementType: O O O O N C C C C C C C C C C C H H H H H H H H H H H H H
charge: -0.267382 -0.240468 -0.425034 -0.222492 -0.558704 -0.210502 -0.498785 -0.437916 0.282042 0.501322 0.171463 -0.402963 -0.440542 -0.223387 -0.219152 -0.239267 0.286457 0.268726 0.241952 0.253778 0.226689 0.288237 0.284232 0.282613 0.232188 0.225768 0.228034 0.229507 0.383586
chargesum: 0.00000
title: Mulliken charges with hydrogens summed into heavy atoms:
elementType: O O O O N C C C C C C C C C C C
charge: -0.267382 -0.240468 -0.041448 -0.222492 0.013765 0.075955 0.011893 0.042551 0.282042 0.501322 0.171463 -0.120350 -0.208354 0.002381 0.008882 -0.009760
polarizability: 1.77447813e+02 6.14264256e+00 1.30957255e+02 -9.94309810e+00 1.70484330e+00 9.73422205e+01
1716.lowfreq: -5.8589 -4.1319 -0.0004 -0.0003 0.0007 12.7735 25.1426 29.4875 38.2052
frequency: 24.9849 29.4050 38.1710 44.4101 58.2397 69.5951 119.0490 172.4486 199.9509 216.7732 252.1822 263.0722 277.0277 307.9853 335.1545 404.2565 423.9786 454.1248 490.5364 574.0706 582.1007 593.9338 614.4821 621.0085 655.2564 688.9397 705.9687 719.7354 751.8627 768.5574 805.2437 825.6435 860.7424 917.1634 940.6603 964.4909 983.8494 985.6969 989.5403 996.2051 1008.1593 1028.3200 1035.7362 1091.2916 1100.7070 1135.8308 1173.3717 1188.9445 1192.6534 1209.9357 1217.7480 1229.1576 1247.1490 1305.0700 1314.7448 1325.1811 1353.2909 1378.9734 1387.6423 1442.5884 1448.5034 1479.2537 1488.7684 1595.8016 1617.3753 1642.8738 1652.1063 1661.4737 3007.6073 3035.7062 3067.9297 3075.1311 3112.3517 3118.2130 3125.3723 3137.7496 3147.7977 3163.5416 3456.9905 3494.2135 3583.2529
redmass: 6.7336 5.5353 4.6963 5.1703 7.7227 5.6516 4.8592 5.1278 1.3253 4.6759 5.0891 3.8252 3.8405 2.2074 3.2088 2.8412 2.9008 4.9965 3.6160 4.2754 2.0250 3.3669 3.8974 2.4009 1.6609 5.3195 2.0225 3.3731 1.7189 3.6362 4.6596 3.9480 1.2552 1.5851 3.9248 2.0657 1.4214 3.3275 4.8358 1.6272 1.6440 2.1840 2.5087 1.5613 1.6220 3.2027 1.0537 1.5269 1.1367 1.2551 2.0552 1.8758 1.5498 1.5569 1.3367 1.3661 1.4389 1.3891 5.8463 2.1618 1.0896 1.1480 2.1323 6.0700 5.9239 8.9756 1.1342 7.2305 1.0578 1.0586 1.0860 1.1060 1.1049 1.0867 1.0869 1.0919 1.0965 1.1016 1.0454 1.0640 1.0973
irintensity: 0.7552 0.1840 0.7501 0.1478 2.3791 0.1464 0.3454 4.9460 33.1001 11.5787 6.7099 3.2907 3.5032 24.1543 6.5296 0.8113 2.6373 28.1970 12.3635 1.3458 64.6622 11.7962 22.8857 57.6201 269.3434 6.1220 42.1634 8.3428 77.8619 0.4203 4.9608 5.6062 0.4944 27.8055 75.7870 0.4209 0.3562 77.4320 1.5918 7.1752 1.2743 3.0931 168.7332 6.0953 212.4305 36.8238 0.0910 21.6186 0.6332 28.2279 143.9695 4.8844 60.2603 6.3984 2.8741 6.7666 7.3628 4.4369 0.6938 10.3794 19.8749 18.8623 8.4673 0.2222 2.8233 201.5598 79.3758 246.0797 23.7463 5.1966 3.6141 15.7650 7.7631 7.6892 2.6591 17.6963 19.6464 28.8884 3.2048 17.9895 7.4318
temp: 298.150 k
press: 1.00000 atm
elementType: 8 8 8 8 7 6 6 6 6 6 6 6 6 6 6 6 1 1 1 1 1 1 1 1 1 1 1 1 1
symmnumber: 1
zpe: 593377.7 jmol-1
zpe.correction: 0.226006 hartree
zpe.thermalcorrener: 0.241936 hartree
zpe.thermalcorrenthalpy: 0.242881 hartree
zpe.thermalcorrgfe: 0.179738 hartree
zpe.sumelectzpe: -781.429856 hartree
zpe.sumelectthermal: -781.413926 hartree
zpe.sumelectthermalent: -781.412981 hartree
zpe.sumelectthermalfe: -781.476124 hartree
dipole: -1.8400 -1.7299 1.0640
dipole: 2.7405
quadrupole: -91.3514 -87.1390 -96.9873
quadrupole: -3.0764 3.9511 3.4493
quadrupole: 0.4745 4.6869 -5.1614 -3.0764 3.9511 3.4493
hfenergy: -781.6558619 hartree
pointgroup: C01 [X(C11H13N1O4)]
dipole: 0.7699549 -0.610875 -0.4432903 debye
polarizability: 178.1802847|-2.5696124|130.5027488|-9.406646|-0.7802935|97.0642554 unknown
InChI: InChI=1S/C11H13NO4/c12-9(11(14)15)6-10(13)16-7-8-4-2-1-3-5-8/h1-5,9,14H,6-7,12H2
charge 0 multiplicity 1
29 atoms
O  -0.170502 1.354905 -0.369491
O  -1.539466 1.890622 1.453019
O  -1.533642 -1.498514 1.121981
O  -3.830194 -1.69376 0.819177
N  -3.460416 -0.881558 -1.949218
C  -2.474101 -0.546184 -0.92038
C  -2.515458 0.993803 -0.636794
C  1.057229 1.705973 0.417297
C  -1.403095 1.468237 0.282877
C  2.120072 0.660495 0.166125
C  -2.720087 -1.302652 0.400385
C  1.8445 -0.712946 0.393811
C  3.411827 1.044968 -0.268145
C  2.850978 -1.681509 0.191331
C  4.422396 0.075222 -0.462211
C  4.144078 -1.291107 -0.232938
H  -1.462494 -0.791387 -1.284202
H  -2.418154 1.478027 -1.62247
H  -3.484978 1.270942 -0.189303
H  0.75939 1.767837 1.480625
H  1.379684 2.70438 0.074854
H  -4.427712 -0.855996 -1.607033
H  -3.258805 -1.748304 -2.456077
H  0.840263 -1.016315 0.712115
H  3.629675 2.103562 -0.457393
H  2.630477 -2.740954 0.365267
H  5.419016 0.384277 -0.79663
H  4.924499 -2.044858 -0.386717
H  -1.74038 -1.913806 2.004137
