program: Gaussian 09
title: 000101164
version: EM64L-G09RevD.01
frameworkgroup: C1[X(C4H5ClO2)]
method: RPBEPBE
basis: SDD
operation: Freq
keyword: #p
keyword: freq=noraman
keyword: PBEPBE/SDD
title: #p freq=noraman PBEPBE/SDD
converged: YES YES NO NO
title: Mulliken charges:
elementType: Cl O O C C C C H H H H H
charge: -0.004513 -0.207177 -0.171740 -0.405593 -0.486350 -0.300095 0.271959 0.252254 0.264499 0.309697 0.246270 0.230788
chargesum: 0.00000
title: Mulliken charges with hydrogens summed into heavy atoms:
elementType: Cl O O C C C C
charge: -0.004513 -0.207177 -0.171740 0.111160 -0.176652 0.176963 0.271959
polarizability: 6.72686545e+01 6.87191210e+00 5.63725525e+01 -2.14198291e+00 -2.02388949e-01 3.80543233e+01
1716.lowfreq: -11.0466 -2.5664 0.0012 0.0024 0.0030 9.2921 90.4471 185.9538 197.9333
frequency: 90.4342 185.9521 197.9332 315.2161 432.1697 486.8474 630.2732 642.7847 732.4472 820.6318 869.9896 917.4102 973.4917 1000.3576 1068.4102 1100.3548 1161.4455 1182.6726 1213.4073 1265.2525 1308.0613 1339.2069 1469.1345 1486.0721 1721.1210 3030.4941 3040.4257 3065.9105 3110.4531 3124.6970
redmass: 4.2775 3.0822 6.9524 4.6756 4.9339 6.8044 3.5894 7.6922 4.8074 2.8299 2.5163 3.4147 2.3853 2.6892 3.0855 2.6235 1.2224 1.2977 1.2314 1.3264 1.2823 1.3430 1.0888 1.0858 12.9087 1.0630 1.0623 1.0857 1.1033 1.1067
irintensity: 0.7110 1.3957 4.2057 3.0288 5.4930 4.7840 6.3575 7.7129 7.7796 26.0892 60.6680 26.2971 22.5954 29.6292 120.7453 38.8673 2.8280 9.9273 6.5081 1.3164 13.8779 0.1905 13.9343 3.8893 270.1422 42.2624 7.9006 5.7656 10.2093 21.0536
temp: 298.150 k
press: 1.00000 atm
elementType: 17 8 8 6 6 6 6 1 1 1 1 1
symmnumber: 1
zpe: 227189.1 jmol-1
zpe.correction: 0.086532 hartree
zpe.thermalcorrener: 0.092975 hartree
zpe.thermalcorrenthalpy: 0.093920 hartree
zpe.thermalcorrgfe: 0.055220 hartree
zpe.sumelectzpe: -765.383328 hartree
zpe.sumelectthermal: -765.376884 hartree
zpe.sumelectthermalent: -765.375940 hartree
zpe.sumelectthermalfe: -765.414639 hartree
dipole: -1.7964 -5.1313 1.2684
dipole: 5.5827
quadrupole: -49.7331 -52.7396 -44.5642
quadrupole: 4.7943 -0.7829 0.4923
quadrupole: -0.7208 -3.7273 4.4481 4.7943 -0.7829 0.4923
hfenergy: -765.4698594 hartree
pointgroup: C01 [X(C4H5Cl1O2)]
dipole: 1.1655579 -1.8008427 -0.4718059 debye
dipolederiv: -0.4612156 -0.0648163 0.0404511 -0.0676806 -0.1572666 0.0140137 0.1146198 0.0302538 -0.1573538 -1.19016 0.451502 -0.0533837 0.0847825 -0.5992306 -0.01391 -0.1755864 0.0480121 -0.2897153 -0.6638164 0.265414 -0.0363828 0.3269178 -0.9311148 0.0123468 -0.0328734 -0.0407153 -0.3093029 -0.1972406 -0.0551768 -0.0272969 -0.0283921 -0.0418711 0.0760191 -0.0037593 0.0120922 0.0490583 0.551561 0.0515725 -0.1432398 -0.0564434 -0.1130129 -0.1063382 -0.2168523 -0.1141605 0.2759009 0.3665644 -0.0826439 -0.0217205 -0.2421004 0.5023411 0.0161554 -0.0738489 0.0198531 0.3575299 1.4593707 -0.5925763 0.1723952 -0.1114414 1.2139126 0.0243105 0.3001233 0.0709319 0.2217364 0.0910272 0.0077716 0.0054424 0.0283323 -0.0777209 -0.0744636 0.0182786 -0.0950429 0.0589007 0.0686025 -0.0296253 0.0371322 0.0010426 0.0943565 0.016928 0.025427 0.0504726 -0.0622125 0.0011831 -0.0067518 0.0309465 -0.0215929 0.0677394 0.0213772 0.0174778 0.0240479 -0.0522563 -0.0381719 0.0384779 -0.066602 0.0393075 0.0437134 0.0115227 -0.1182864 0.0262323 0.0057499 0.0122958 0.0168524 0.0622584 0.047268 -0.0018461 0.0020384 0.1452804 -0.0319771 -0.0980352 unknown
polarizability: 69.6785872|-3.5456883|53.6898967|-3.2799359|-0.8484554|38.3270464 unknown
InChI: InChI=1S/C4H5ClO2/c5-3-1-2-7-4(3)6/h3H,1-2H2
charge 0 multiplicity 1
12 atoms
Cl -2.243037 -0.923215 0.297841
O  1.294525 0.825047 0.177985
O  -0.742222 1.926434 -0.050438
C  0.542319 -1.47485 0.102758
C  -0.56374 -0.555971 -0.43613
C  1.797453 -0.574801 -0.005716
C  -0.094635 0.875977 -0.087173
H  0.640064 -2.414679 -0.462279
H  0.333863 -1.71692 1.158558
H  -0.704674 -0.634421 -1.526614
H  2.542884 -0.750386 0.78335
H  2.278301 -0.629016 -0.99824
