program: Gaussian 09
title: 000101148
version: EM64L-G09RevD.01
frameworkgroup: C1[X(C9H12O2)]
method: RPBEPBE
basis: SDD
operation: Freq
keyword: #pfreq=noraman
keyword: PBEPBE/SDD
title: #p freq=noraman PBEPBE/SDD
converged: YES YES NO NO
title: Mulliken charges:
elementType: O O C C C C C C C C C H H H H H H H H H H H H
charge: -0.449787 -0.266459 -0.197504 0.428315 -0.421876 -0.385299 -0.680949 0.318291 -0.344653 -0.347201 -0.538053 0.195482 0.233791 0.262318 0.230297 0.214787 0.234107 0.249907 0.239630 0.337706 0.221560 0.220396 0.245194
chargesum: 0.00000
title: Mulliken charges with hydrogens summed into heavy atoms:
elementType: O O C C C C C C C C C
charge: -0.112081 -0.266459 -0.002022 0.428315 -0.188085 -0.122981 -0.001757 0.318291 -0.094746 -0.107571 0.149097
polarizability: 1.47688327e+02 2.92044233e+00 9.99307381e+01 -1.35035571e-01 -2.02324730e+00 6.49091878e+01
1716.lowfreq: -8.5652 -0.0002 0.0003 0.0007 3.6491 11.6333 50.3812 71.5261 120.4286
frequency: 49.8165 71.1820 120.4168 154.2421 204.9368 229.1759 256.0930 265.9348 292.1573 362.6042 405.6748 414.6546 431.1352 496.6932 545.9227 550.6814 627.6387 705.9670 736.4513 792.2294 818.1938 833.8654 872.7011 946.2550 962.7045 983.4240 989.1224 1003.3517 1057.0031 1075.1980 1111.1535 1114.2776 1156.1406 1175.3457 1202.6099 1228.9785 1242.8081 1290.0924 1316.2358 1350.6906 1390.0617 1391.2482 1417.4515 1435.5589 1459.2960 1466.9221 1472.6617 1474.1286 1500.7778 1585.4531 1621.0568 2940.8886 2958.7036 2994.1316 3046.2242 3097.3989 3099.4932 3118.9924 3124.4048 3135.6718 3160.7761 3166.1455 3550.9455
redmass: 3.5643 3.2286 3.8584 3.7217 1.8269 1.1181 1.5629 3.1798 3.4892 1.1823 4.1513 2.9480 3.6038 3.7403 2.4692 4.2859 6.9500 3.4187 3.6795 4.6634 1.3161 1.5568 2.8111 1.3589 1.3564 2.7264 5.6633 2.4955 1.6431 1.8520 1.2605 1.3475 1.3389 1.2217 1.8708 3.4988 1.2965 1.4336 1.3749 1.6783 1.4665 2.5553 3.0605 1.1759 1.0543 1.0505 1.0681 1.0625 2.4222 7.0328 6.3703 1.0848 1.0330 1.0350 1.1039 1.1002 1.1005 1.0895 1.0992 1.0880 1.0948 1.0951 1.0658
irintensity: 2.6026 2.3962 4.8169 3.0089 1.2588 3.8096 0.7420 1.4888 11.0122 175.4790 0.5328 1.0695 7.0872 5.0068 28.4134 24.9513 1.3614 4.8402 1.2145 3.5392 14.1131 65.4389 27.1761 0.9486 0.3088 48.1796 28.7270 11.6761 31.9497 38.3591 0.2246 10.5631 0.7246 53.7749 5.3329 162.9128 53.7584 22.3990 2.5681 45.3051 21.8020 12.8979 2.9053 8.9239 4.6444 13.3557 26.6499 33.0842 86.6750 7.9443 60.8007 56.1143 64.3213 19.7759 50.1252 27.4579 34.1178 17.4242 26.2842 4.9564 14.6006 5.0446 5.2313
temp: 298.150 k
press: 1.00000 atm
elementType: 8 8 6 6 6 6 6 6 6 6 6 1 1 1 1 1 1 1 1 1 1 1 1
symmnumber: 1
zpe: 496762.2 jmol-1
zpe.correction: 0.189207 hartree
zpe.thermalcorrener: 0.200397 hartree
zpe.thermalcorrenthalpy: 0.201341 hartree
zpe.thermalcorrgfe: 0.152252 hartree
zpe.sumelectzpe: -499.748120 hartree
zpe.sumelectthermal: -499.736930 hartree
zpe.sumelectthermalent: -499.735986 hartree
zpe.sumelectthermalfe: -499.785075 hartree
dipole: -1.9098 -0.4375 -0.1452
dipole: 1.9646
quadrupole: -65.5038 -61.8849 -65.6271
quadrupole: 11.3220 -0.4628 -0.9424
quadrupole: -1.1652 2.4537 -1.2885 11.3220 -0.4628 -0.9424
hfenergy: -499.9373267 hartree
pointgroup: C01 [X(C9H12O2)]
dipole: 0.7494795 0.1602758 -0.1001081 debye
dipolederiv: -0.7402624 -0.0581738 -0.243444 -0.0377942 -0.4225457 0.1992936 -0.3150977 0.1853373 -0.5925827 -1.733212 -0.3214167 0.0139134 -0.2053495 -0.3736596 0.0049172 -0.0060572 0.0005583 -0.3003101 0.6686309 0.0254642 0.0969598 0.0371817 0.3916014 -0.1181742 0.1981212 -0.1153477 0.6124703 -0.0981638 -0.0395595 -0.0639241 -0.027344 -0.2212481 0.0499895 -0.0607371 0.0143902 -0.168757 0.1166067 -0.0406044 0.0179501 -0.0126782 0.1269235 -0.0467424 -0.0148833 -0.0558855 -0.1467072 0.0686217 0.0866948 0.0009912 -0.0270199 0.1027347 -0.0308049 0.0526751 -0.0217329 -0.1382085 -0.1073453 0.0232554 0.0780627 0.0565569 0.0338661 -0.0725042 -0.0286342 -0.0442583 -0.0865336 1.5636402 0.1721111 0.0129248 -0.0667477 0.0175136 0.0146577 0.0524072 0.0160455 0.0906604 -0.3625333 -0.0264168 -0.0034275 -0.2981129 0.0146424 -0.0332413 0.0468741 -0.0277981 -0.1582948 -0.333968 -0.0495044 0.0084355 0.2938687 -0.0045723 -0.0292011 -0.0540688 -0.0363636 -0.19612 0.5823142 0.1659475 -0.0188734 0.5055873 0.44871 -0.0064211 -0.0677214 -0.012737 0.3274744 -0.0182778 -0.0154637 -0.0208194 -0.0827585 -0.2201335 0.0039598 0.0019898 -0.0122353 -0.0195137 0.0221538 -0.1154863 0.008277 -0.0907837 -0.0492405 0.0256476 0.0055525 0.0256966 0.1371249 0.0611757 0.075052 -0.0131664 0.080126 -0.0174973 0.0205052 -0.0098739 0.0223998 0.1404546 0.0796296 -0.0941493 0.0009082 -0.0548523 -0.0977701 -0.0575561 0.0005071 0.0009725 0.0812317 0.0977714 0.054113 -0.0673996 0.0262516 0.016694 0.1159228 -0.0574845 0.0740384 -0.057501 -0.2175595 0.0013466 0.0266963 0.0210104 0.102952 -0.0218144 0.0317388 -0.009557 0.0885536 0.0381604 0.0813267 -0.0158254 0.0788318 -0.0135086 0.0291802 -0.0162263 0.0285635 0.1653488 0.021574 -0.0909394 0.0108033 -0.105578 -0.0345468 0.029524 0.0061429 0.0323341 0.1583025 0.3320596 0.0793824 0.1828882 0.1029735 0.2267136 -0.0689382 0.2057149 -0.0636948 0.1226378 0.0570641 0.0512396 0.0709276 -0.1226964 -0.0840734 -0.1043627 0.0268979 -0.11137 -0.0560059 0.0619176 0.021633 -0.0712484 -0.1313049 -0.0232115 0.0874085 0.0218852 0.1034465 -0.1250433 -0.1599982 0.014148 -0.0116098 0.0606323 0.079656 0.0087547 -0.0197224 0.0071976 0.1213187 unknown
polarizability: 147.6225447|3.3253518|98.8476362|-0.7923864|-6.5638058|66.0580722 unknown
InChI: InChI=1S/C9H12O2/c1-7(10)8-3-5-9(11-2)6-4-8/h3-7,10H,1-2H3
charge 0 multiplicity 1
23 atoms
O  -3.166567 0.647445 -1.143647
O  3.135113 -0.286114 0.110783
C  -2.632428 -0.195267 -0.046477
C  -1.106958 -0.193685 -0.031108
C  -0.379132 -1.395002 0.170027
C  -0.383731 1.011787 -0.19925
C  -3.25267 0.382438 1.235441
C  1.736129 -0.178853 0.052124
C  1.02753 -1.39514 0.216138
C  1.028124 1.031582 -0.160361
C  3.915082 0.943895 -0.042365
H  -2.985372 -1.242029 -0.179852
H  -0.91926 -2.342484 0.292173
H  -0.936089 1.943107 -0.368523
H  -2.925346 1.427075 1.377399
H  -2.940958 -0.205798 2.116276
H  -4.35396 0.366873 1.163214
H  1.596275 -2.317068 0.370829
H  1.557635 1.979545 -0.2963
H  -2.715471 0.385217 -1.986779
H  3.677148 1.674017 0.755676
H  3.745507 1.409149 -1.033134
H  4.965699 0.630011 0.044017
