program: Gaussian 09
title: 000101147
version: EM64L-G09RevD.01
frameworkgroup: C1[X(C11H18O4)]
method: RPBEPBE
basis: SDD
operation: Freq
keyword: #pfreq=noraman
keyword: PBEPBE/SDD
title: #p freq=noraman PBEPBE/SDD
converged: YES YES NO NO
title: Mulliken charges:
elementType: O O O O C C C C C C C C C C C H H H H H H H H H H H H H H H H H H
charge: -0.289258 -0.260000 -0.227831 -0.245612 0.044809 -0.447297 -0.430082 -0.396724 -0.401595 -0.388604 0.263317 -0.094029 -0.706261 0.312401 -0.759110 0.231170 0.208211 0.210945 0.244837 0.204384 0.206624 0.197508 0.199504 0.208789 0.203898 0.192102 0.260837 0.236632 0.237687 0.233611 0.260237 0.246224 0.242675
chargesum: 0.00000
title: Mulliken charges with hydrogens summed into heavy atoms:
elementType: O O O O C C C C C C C C C C C
charge: -0.289258 -0.260000 -0.227831 -0.245612 0.275979 -0.028141 0.019139 0.007408 0.006698 0.007397 0.263317 0.166808 0.001669 0.312401 -0.009974
polarizability: 1.57776971e+02 -2.57015291e+00 1.26379328e+02 5.94983691e+00 -1.43134793e+00 1.03493484e+02
1716.lowfreq: -29.3187 -16.6207 -5.1632 -0.0010 -0.0009 -0.0003 8.7614 28.5135 47.0842
frequency: -6.4509 24.5211 46.2367 56.8294 73.1509 88.8180 94.0001 153.8158 178.8645 196.8023 209.1918 222.8421 253.2172 305.1507 323.1926 331.5224 374.9689 405.6998 428.2165 442.7810 477.1610 555.9788 560.6108 616.2494 658.7071 702.0330 782.2440 787.1030 802.6915 824.6211 843.9964 877.3820 894.6841 907.9783 922.4785 934.8185 994.9203 998.6127 1031.9955 1041.9722 1042.6271 1050.7830 1077.8707 1083.7845 1105.9530 1116.6563 1149.7762 1151.9455 1199.2352 1202.2312 1239.7148 1252.3631 1259.0456 1283.6861 1298.7254 1308.9171 1317.6471 1329.4243 1335.6426 1339.0975 1349.6223 1361.1312 1382.6056 1389.0409 1453.2514 1453.7421 1462.2921 1463.8461 1464.7570 1466.1371 1471.5332 1477.2841 1480.6699 1644.5127 1658.0307 2971.4110 2972.3851 2974.1323 2988.3296 2991.8581 3003.8672 3007.3045 3010.2115 3035.7538 3038.0140 3040.4097 3046.3600 3056.6657 3068.5732 3100.4702 3108.6919 3112.8778 3141.3210
redmass: 4.6243 3.3555 4.6803 3.2811 1.1922 5.4782 3.6716 3.8943 3.0412 3.4174 1.7968 1.1672 3.3848 3.3570 2.5309 4.7168 4.4861 3.5213 2.8421 2.6315 2.0264 2.6690 3.2221 5.1496 5.8303 4.3937 2.1765 1.6078 2.8724 3.4760 2.6704 1.8102 1.6585 3.6461 1.7251 3.5371 2.2361 2.1131 2.0907 1.9053 1.6587 1.0803 2.2401 1.3332 2.6880 3.1142 2.4744 2.2980 1.5055 3.0747 1.3063 1.2765 1.2993 1.5003 1.1908 1.3163 1.4105 1.3505 1.4850 1.4799 1.5488 1.4926 1.2434 1.2190 1.0544 1.0568 1.0851 1.0907 1.0910 1.0471 1.0826 1.0530 1.0974 10.7649 10.1631 1.0669 1.0619 1.0619 1.0616 1.0649 1.0348 1.0377 1.0824 1.0956 1.0981 1.0846 1.1007 1.1024 1.1024 1.0948 1.1010 1.1004 1.1022
irintensity: 1.3826 0.3505 2.0882 1.5207 1.0917 0.9031 3.4682 3.0976 4.7734 0.6123 0.0195 1.6409 4.9361 1.1689 3.2767 2.4820 17.6785 4.9730 1.2311 2.5380 0.9914 2.5299 1.6831 7.1282 12.3744 2.3324 3.2489 0.3323 8.6190 9.6954 6.2199 2.5455 17.1162 19.5089 1.2420 51.7624 97.3609 29.8802 38.5120 0.2347 9.5307 0.1650 309.6806 5.7691 3.1740 103.6175 178.8077 5.0870 2.1513 217.1731 0.4716 2.9114 2.5831 6.8941 1.8336 0.5919 23.5848 0.3502 0.6393 0.5996 1.2260 5.7660 59.0622 16.6326 19.3943 23.1054 0.7919 6.8121 14.2574 13.8951 21.5305 15.6373 3.6533 209.9571 118.7473 30.4643 32.8158 35.6733 14.2379 10.8794 15.6498 1.6203 20.4743 61.1856 60.9326 4.1825 35.1839 42.7392 48.5152 8.4863 20.6420 17.8560 8.9417
temp: 298.150 k
press: 1.00000 atm
elementType: 8 8 8 8 6 6 6 6 6 6 6 6 6 6 6 1 1 1 1 1 1 1 1 1 1 1 1 1 1 1 1 1 1
symmnumber: 1
zpe: 725046.3 jmol-1
zpe.correction: 0.276156 hartree
zpe.thermalcorrener: 0.291790 hartree
zpe.thermalcorrenthalpy: 0.292734 hartree
zpe.thermalcorrgfe: 0.231851 hartree
zpe.sumelectzpe: -729.696961 hartree
zpe.sumelectthermal: -729.681326 hartree
zpe.sumelectthermalent: -729.680382 hartree
zpe.sumelectthermalfe: -729.741265 hartree
dipole: -1.1346 1.7340 -0.1528
dipole: 2.0779
quadrupole: -74.7903 -88.3205 -93.7311
quadrupole: 1.1033 0.5176 -2.4534
quadrupole: 10.8237 -2.7065 -8.1171 1.1033 0.5176 -2.4534
hfenergy: -729.9731162 hartree
pointgroup: C01 [X(C11H18O4)]
dipole: -0.4465987 0.6815097 0.0662344 debye
polarizability: 157.2744161|-3.9933148|126.0019275|7.3042398|3.1763817|104.3734389 unknown
InChI: InChI=1S/C11H18O4/c1-8(14-9(2)12)11(13)15-10-6-4-3-5-7-10/h8,10H,3-7H2,1-2H3
charge 0 multiplicity 1
33 atoms
O  -0.468354 0.806731 -0.233563
O  3.1366 0.388338 0.243398
O  0.695344 -0.580923 1.248687
O  2.628002 -1.295734 -1.288242
C  -1.77766 0.159227 0.144132
C  -2.871273 1.200376 -0.121974
C  -1.969146 -1.12158 -0.68667
C  -4.267155 0.58747 0.162808
C  -3.362412 -1.735043 -0.396931
C  -4.492012 -0.708854 -0.653815
C  0.676562 0.316571 0.380278
C  1.894777 1.08917 -0.15785
C  1.985159 2.505421 0.42437
C  3.365352 -0.851527 -0.38137
C  4.578906 -1.524274 0.212614
H  -1.72045 -0.095833 1.220656
H  -2.811356 1.519509 -1.180956
H  -2.700542 2.095966 0.503926
H  -1.16661 -1.844264 -0.455608
H  -1.890191 -0.861393 -1.760531
H  -5.052064 1.331916 -0.069208
H  -4.355149 0.356846 1.24459
H  -3.404198 -2.072481 0.659188
H  -3.506973 -2.634911 -1.023824
H  -5.474788 -1.150845 -0.40081
H  -4.519171 -0.459542 -1.734582
H  1.82282 1.105839 -1.260207
H  2.071575 2.4687 1.523518
H  2.872643 3.019562 0.019251
H  1.08326 3.078661 0.152003
H  4.281308 -2.031936 1.14832
H  5.356347 -0.785894 0.464673
H  4.970351 -2.276572 -0.487973
