program: Gaussian 09
title: 000101130
version: EM64L-G09RevD.01
frameworkgroup: C1[X(C9H10O)]
method: RPBEPBE
basis: SDD
operation: Freq
keyword: #pfreq=noraman
keyword: PBEPBE/SDD
title: #p freq=noraman PBEPBE/SDD
converged: YES YES NO NO
title: Mulliken charges:
elementType: O C C C C C C C C C H H H H H H H H H H
charge: -0.281594 -0.005572 -0.542458 0.232638 0.203192 -0.704454 -0.389256 -0.364542 -0.247974 -0.202219 0.227230 0.231291 0.233106 0.238751 0.228044 0.211263 0.236689 0.246989 0.223580 0.225294
chargesum: 0.00000
title: Mulliken charges with hydrogens summed into heavy atoms:
elementType: O C C C C C C C C C
charge: -0.281594 0.221658 -0.078061 0.232638 0.203192 -0.026396 -0.152566 -0.117552 -0.024394 0.023076
polarizability: 1.32364934e+02 -2.24205619e+00 9.79443906e+01 2.86621662e+00 5.82747435e-03 5.33897680e+01
1716.lowfreq: -6.2818 -0.0006 0.0005 0.0006 8.8092 17.3143 55.8041 177.0420 216.4838
frequency: 55.5756 177.0201 216.4814 240.1108 267.8169 408.5642 415.4776 423.7536 517.3015 539.8545 586.6698 634.7871 709.6021 753.0870 761.1780 794.8586 845.0633 853.4613 889.4231 911.7097 934.9421 970.1768 1015.1510 1031.5974 1080.2295 1096.0839 1140.5465 1160.2322 1163.8008 1184.5031 1230.8151 1236.0959 1286.7648 1305.7630 1346.3128 1389.2442 1399.0232 1446.3743 1459.1044 1461.8473 1471.5896 1477.4343 1605.1054 1617.5446 2980.1598 2989.4865 2992.6824 3056.5273 3086.3004 3099.7363 3126.3040 3136.8384 3158.0499 3173.3951
redmass: 3.1664 2.5383 1.2099 3.8443 2.6276 2.9301 2.8456 3.2567 3.2622 3.8435 6.5463 5.2084 3.0891 1.4651 4.0497 3.6133 4.7506 1.3567 2.4560 1.4495 1.3544 1.2966 2.0884 1.9006 1.9016 1.8349 1.9118 2.1143 1.0971 1.4868 2.6134 1.3740 1.4512 1.3244 1.5391 1.3445 4.5993 2.4610 1.0878 1.1614 2.2569 1.0865 7.1762 7.6222 1.0661 1.0379 1.0834 1.0982 1.0987 1.1006 1.0860 1.0906 1.0957 1.0982
irintensity: 0.9181 4.2785 0.7082 3.0246 1.9668 2.1494 6.8185 2.3277 0.6919 0.5879 2.4112 1.3392 4.6239 86.7614 14.4696 20.0296 31.0478 3.2919 22.0778 0.6217 3.2818 0.0619 15.1025 30.6934 13.3347 13.4322 6.3667 27.9787 3.4099 19.4938 88.3841 16.9591 2.9531 0.1679 16.0811 18.2384 15.7950 22.8360 8.9857 14.5783 67.3966 15.3659 16.2139 17.3042 26.2163 26.9404 36.7782 21.2365 28.4399 33.2187 1.1834 17.3464 29.5923 11.9579
temp: 298.150 k
press: 1.00000 atm
elementType: 8 6 6 6 6 6 6 6 6 6 1 1 1 1 1 1 1 1 1 1
symmnumber: 1
zpe: 432519.2 jmol-1
zpe.correction: 0.164738 hartree
zpe.thermalcorrener: 0.173097 hartree
zpe.thermalcorrenthalpy: 0.174042 hartree
zpe.thermalcorrgfe: 0.131480 hartree
zpe.sumelectzpe: -423.448794 hartree
zpe.sumelectthermal: -423.440435 hartree
zpe.sumelectthermalent: -423.439490 hartree
zpe.sumelectthermalfe: -423.482052 hartree
dipole: -0.9982 1.7806 -0.1894
dipole: 2.0501
quadrupole: -51.4873 -56.5371 -61.7631
quadrupole: -3.2442 1.0272 -0.2447
quadrupole: 5.1086 0.0587 -5.1672 -3.2442 1.0272 -0.2447
hfenergy: -423.6135319 hartree
pointgroup: C01 [X(C9H10O1)]
dipole: 0.3888705 0.7030472 0.0712081 debye
dipolederiv: -1.5586243 0.0843534 -0.0809901 0.1119361 -0.4007181 -0.0010559 -0.0395352 -0.0015715 -0.2781424 0.8273112 0.0631778 0.0294155 0.356928 0.2927121 0.0521985 0.0901902 0.0183647 0.3900123 -0.1726273 0.0990498 -0.0180287 -0.0344305 -0.0283181 0.0207075 -0.0251116 0.0321671 0.1706677 -0.0093785 0.0205463 -0.0110108 0.5117914 -0.0848217 0.0186233 -0.046351 -0.0240041 -0.1035701 1.1792773 -0.2228898 0.0798316 -0.6116818 0.0927322 -0.0468983 0.0585848 -0.0172275 0.0723142 -0.1372188 0.0124553 0.0744045 0.0107291 0.0625942 -0.0104444 0.0816726 -0.0006407 0.0128161 0.1239818 0.050517 0.0256646 -0.0765599 0.1345608 -0.0052602 0.0274002 -0.0002685 -0.1421879 -0.3174768 0.1400075 -0.0061777 -0.078384 0.0726562 -0.0094482 -0.020288 0.0081525 -0.1909786 -0.0966689 -0.0706976 0.0031181 -0.1138464 -0.170243 -0.005157 0.0090468 0.0045891 -0.2035974 0.0955055 -0.0701199 0.0158828 0.0590958 0.1389114 0.0037075 0.0129109 -0.0093373 -0.1532616 -0.0278329 0.0050825 -0.0114926 -0.0723285 0.0302207 0.0019837 -0.097597 -0.0029584 -0.1881821 -0.0140312 -0.0635031 0.053378 -0.0421524 0.0400275 0.0534276 0.0821166 0.1046744 -0.0830546 0.0417171 -0.0378169 -0.0204172 -0.0523716 -0.0415764 -0.0890602 -0.0528628 -0.1227251 0.0056435 0.0306825 0.0746752 -0.0077389 0.1484104 -0.0651992 0.0401574 -0.0060357 0.0572732 0.0808172 0.0757823 0.0043978 -0.0738655 0.0191716 0.0917953 0.013243 -0.0128648 0.0018651 -0.1269989 -0.0345907 -0.0851088 -0.0162207 -0.1475554 -0.0393966 -0.0440557 -0.0185157 -0.0534216 0.081094 0.0872475 -0.0074725 -0.004843 0.023169 -0.1161514 0.0044719 -0.0089019 0.0016348 0.1525317 0.0922452 0.0245178 -0.0054043 0.0049461 -0.0764994 0.0026302 -0.0078379 0.0063162 0.1755781 -0.1054271 0.0818671 -0.0140286 0.0861829 0.0415465 0.0051537 -0.0148107 0.0026083 0.1702996 -0.0798737 -0.1030389 -0.0114769 -0.1030498 0.0251673 -0.0049243 -0.0112099 -0.0054908 0.1581992 unknown
polarizability: 132.3400968|2.4447151|97.9692951|2.8422796|-0.1953719|53.3897009 unknown
InChI: InChI=1S/C9H10O/c1-7-6-8-4-2-3-5-9(8)10-7/h2-5,7H,6H2,1H3
charge 0 multiplicity 1
20 atoms
O  1.203408 -1.140315 0.133114
C  2.106453 0.050847 0.407257
C  1.257911 1.313313 0.058165
C  -0.16595 0.772215 0.043373
C  -0.109188 -0.64267 0.059355
C  3.391018 -0.134079 -0.394826
C  -1.411485 1.417606 -0.033906
C  -1.260644 -1.446322 -0.005529
C  -2.592652 0.630645 -0.091773
C  -2.511355 -0.783101 -0.081541
H  2.31119 0.014613 1.49557
H  1.5405 1.711529 -0.936535
H  1.411241 2.118544 0.797693
H  3.879367 -1.089324 -0.136658
H  3.174359 -0.135037 -1.477461
H  4.09825 0.687787 -0.177913
H  -1.475353 2.51171 -0.051187
H  -1.186964 -2.537495 0.006034
H  -3.571328 1.119279 -0.145492
H  -3.429778 -1.379143 -0.128643
