program: Gaussian 09
title: 000009775
version: EM64L-G09RevD.01
frameworkgroup: C1[X(C2Cl2F4)]
method: RPBEPBE
basis: SDD
operation: Freq
keyword: #pfreq=noraman
keyword: PBEPBE/SDD
title: #p freq=noraman PBEPBE/SDD
converged: NO NO NO YES
title: Mulliken charges:
elementType: Cl Cl F F F F C C
charge: 0.134622 0.134851 -0.086880 -0.130107 -0.131523 -0.130487 -0.323553 0.533078
chargesum: 0.00000
title: Mulliken charges with hydrogens summed into heavy atoms:
polarizability: 3.70860831e+01 1.17892615e-02 5.44469635e+01 5.05276340e+00 -6.23186173e-04 3.42816504e+01
1716.lowfreq: -9.5884 -0.0023 -0.0016 0.0019 3.8958 11.5365 61.1389 162.8481 180.3420
frequency: 61.1272 162.8477 180.3420 238.7538 282.8310 289.5276 352.3096 353.9244 441.1921 482.0336 518.5591 635.2872 791.2230 845.8569 989.8329 1061.3669 1071.5434 1166.0807
redmass: 21.2947 24.4325 21.9277 23.9726 20.4239 19.5388 22.7598 24.9262 20.9171 18.4411 17.6880 16.9557 12.7705 13.7943 13.4707 13.0846 13.1610 12.4347
irintensity: 0.0561 1.7645 2.0949 0.8170 0.3182 1.0464 0.2133 0.0003 4.8229 9.9496 4.0284 37.1135 221.5929 121.5370 98.0993 176.4412 262.7905 99.8218
temp: 298.150 k
press: 1.00000 atm
elementType: 17 17 9 9 9 9 6 6
symmnumber: 1
zpe: 59362.5 jmol-1
zpe.correction: 0.022610 hartree
zpe.thermalcorrener: 0.030684 hartree
zpe.thermalcorrenthalpy: 0.031629 hartree
zpe.thermalcorrgfe: -0.011268 hartree
zpe.sumelectzpe: -1395.048145 hartree
zpe.sumelectthermal: -1395.040070 hartree
zpe.sumelectthermalent: -1395.039126 hartree
zpe.sumelectthermalfe: -1395.082022 hartree
dipole: -0.8600 -0.0012 -0.4282
dipole: 0.9607
quadrupole: -58.2630 -56.5052 -59.3252
quadrupole: -0.0048 0.8026 -0.0012
quadrupole: -0.2318 1.5259 -1.2941 -0.0048 0.8026 -0.0012
hfenergy: -1395.0707547 hartree
pointgroup: C01 [X(C2Cl2F4)]
dipole: -0.3077462 0.0003972 0.2194153 debye
dipolederiv: -0.1673276 0.1903553 0.0922044 0.1168038 -0.552431 -0.1860924 0.0598762 -0.1932777 -0.1622485 -0.1681785 -0.1922744 0.0915872 -0.1184962 -0.5536325 0.1831617 0.0597656 0.1904877 -0.1596347 -0.2767099 0.000313 -0.1034427 -0.0002121 -0.3058467 0.002169 0.0443029 0.0018645 -0.891498 -0.4894904 -0.2382003 0.1451393 -0.151343 -0.5973381 0.2003208 0.0708754 0.1743626 -0.3653613 -0.3909276 0.0007416 -0.1459667 0.0006145 -0.2578618 0.0019551 -0.1140679 0.0018267 -0.7358665 -0.4881417 0.2366285 0.1458879 0.1502316 -0.5961723 -0.2023387 0.071136 -0.1760609 -0.3679973 0.5335347 0.0018188 -0.0353323 0.0025654 1.5631933 0.0010657 -0.2539114 0.0014561 1.2545023 1.4472409 0.0006175 -0.1900771 -0.0001641 1.3000891 -0.0002412 0.0620232 -0.0006591 1.4281039 unknown
polarizability: 35.4527134|0.0462737|54.4466455|-5.2384856|0.0731848|35.9153381 unknown
InChI: InChI=1S/C2Cl2F4/c3-1(4,5)2(6,7)8
charge 0 multiplicity 1
8 atoms
Cl -1.471238 1.521106 0.623378
Cl -1.476471 -1.519783 0.613298
F  -1.012722 0.006887 -1.515754
F  1.378843 1.13141 -0.531417
F  1.147443 -0.006957 1.418443
F  1.374564 -1.132994 -0.539235
C  -0.747919 0.001748 -0.129445
C  0.807401 -0.001419 0.060733
