program: Gaussian 09
title: 000101118
version: EM64L-G09RevD.01
frameworkgroup: C1[X(C3H6BrNO)]
method: RPBEPBE
basis: SDD
operation: Freq
keyword: #p
keyword: freq=noraman
keyword: PBEPBE/SDD
title: #p freq=noraman PBEPBE/SDD
converged: YES YES NO NO
title: Mulliken charges:
elementType: Br O N C C C H H H H H H
charge: -0.058400 -0.256346 -0.588127 -0.473286 -0.629669 0.270476 0.309038 0.263796 0.242538 0.245516 0.341280 0.333184
chargesum: 0.00000
title: Mulliken charges with hydrogens summed into heavy atoms:
elementType: Br O N C C C
charge: -0.058400 -0.256346 0.086337 -0.164248 0.122181 0.270476
polarizability: 8.12178560e+01 7.46488835e+00 5.78890982e+01 -3.01020034e+00 -5.04234156e+00 3.60329380e+01
1716.lowfreq: -7.5539 -0.0008 -0.0006 -0.0005 9.5675 13.5492 41.5078 195.4957 237.4306
frequency: 41.4681 195.4947 237.4283 264.7932 289.9335 317.9608 491.3469 586.1195 609.1446 617.7164 711.0986 791.5483 975.6779 1058.4833 1066.6543 1079.2197 1191.7753 1281.2246 1363.4123 1386.7214 1462.5803 1473.6010 1573.7297 1637.7524 2997.2366 3084.2555 3099.0396 3116.2596 3500.3074 3656.0003
redmass: 5.1213 6.6527 1.2475 2.1720 3.1751 6.6703 2.7723 1.9489 1.5059 1.3551 3.4332 2.8563 1.4924 2.0166 1.9495 1.7484 1.2414 1.3231 3.3384 1.2495 1.0482 1.0571 1.6294 3.0131 1.0350 1.0888 1.0974 1.1006 1.0457 1.1038
irintensity: 14.2130 11.9610 0.7915 1.9468 3.7025 10.0291 6.4412 34.0540 77.7207 204.6297 52.6664 3.5015 24.1807 0.3863 33.0957 15.1897 44.8488 1.0242 81.0724 34.0603 21.1735 10.4559 83.6292 271.8357 8.9675 0.5482 10.3872 15.9064 33.9575 67.3894
temp: 298.150 k
press: 1.00000 atm
elementType: 35 8 7 6 6 6 1 1 1 1 1 1
symmnumber: 1
zpe: 240198.1 jmol-1
zpe.correction: 0.091487 hartree
zpe.thermalcorrener: 0.098623 hartree
zpe.thermalcorrenthalpy: 0.099567 hartree
zpe.thermalcorrgfe: 0.058736 hartree
zpe.sumelectzpe: -260.890787 hartree
zpe.sumelectthermal: -260.883651 hartree
zpe.sumelectthermalent: -260.882707 hartree
zpe.sumelectthermalfe: -260.923537 hartree
dipole: -0.8417 -1.0453 1.2280
dipole: 1.8191
quadrupole: -57.0321 -37.3296 -45.3307
quadrupole: -3.2638 2.8247 -2.4122
quadrupole: -10.4680 9.2346 1.2334 -3.2638 2.8247 -2.4122
hfenergy: -260.9822739 hartree
pointgroup: C01 [X(C3H6Br1N1O1)]
dipole: 0.0315889 0.5155772 -0.4953906 debye
dipolederiv: -0.4039087 0.1905967 0.0071285 0.2641277 -0.6350507 -0.0118724 -0.0333841 0.0646632 -0.1597827 -0.8085283 0.4051006 -0.1124327 0.0298825 -0.8485127 0.2174766 0.0492023 0.1395323 -0.4340345 -0.5824589 -0.3698653 0.1270879 -0.264678 -0.7880962 0.1148845 0.1028222 0.1423959 -0.721025 0.1415376 -0.2996871 0.0525424 -0.5043469 0.9351259 0.0102915 0.1389717 -0.0934367 0.1365128 -0.0317198 0.0812519 -0.0146817 0.0085038 -0.2036866 -0.0753747 -0.0156883 0.0227772 0.0376402 1.0680878 -0.1088499 -0.0754631 0.3453656 1.009454 -0.4934082 -0.2986071 -0.379455 0.3920893 0.0362566 0.0576765 -0.0242052 0.0405866 -0.0316771 0.0456181 0.0128875 -0.0004989 -0.0300693 0.0849301 0.0568393 -0.0379543 0.0574297 -0.0600866 0.0156656 -0.0246806 -0.0021167 0.0996427 0.092572 -0.0357475 0.0318123 -0.0101579 0.0928037 0.0632044 0.0027201 0.0061463 -0.1044143 -0.1126613 -0.0453943 0.0369704 -0.013038 0.1096323 -0.0138943 0.0461447 -0.0208722 0.0796472 0.1833567 0.0415398 0.0149524 0.0387864 0.2084774 0.0671632 0.0269612 0.0693541 0.3598549 0.3325362 0.0265395 -0.0057568 0.0075385 0.2116166 0.0602457 -0.0073497 0.0515105 0.3439386 unknown
polarizability: 63.6368015|-12.421581|75.1836818|-0.3164107|-6.9340837|36.319409 unknown
InChI: InChI=1S/C3H6BrNO/c1-2(4)3(5)6/h2H,5H2,1H3
charge 0 multiplicity 1
12 atoms
Br -1.492516 1.726124 0.499568
O  1.47937 -1.237284 0.981484
N  1.513785 0.899604 0.054056
C  -0.641049 -0.126889 0.849637
C  -1.374714 -1.178841 0.005516
C  0.883726 -0.173818 0.628523
H  -0.828708 -0.274674 1.925077
H  -0.924458 -2.166015 0.215822
H  -1.275763 -0.968951 -1.072762
H  -2.445762 -1.209955 0.263283
H  2.520864 0.84892 -0.097779
H  0.999526 1.745679 -0.193426
