program: Gaussian 09
title: 000101122
version: EM64L-G09RevD.01
frameworkgroup: C1[X(C7H13NO4)]
method: RPBEPBE
basis: SDD
operation: Freq
keyword: #p
keyword: freq=noraman
keyword: PBEPBE/SDD
title: #p freq=noraman PBEPBE/SDD
converged: YES YES NO NO
title: Mulliken charges:
elementType: O O O O N C C C C C C C H H H H H H H H H H H H H
charge: -0.412564 -0.241971 -0.417966 -0.232756 -0.651387 -0.356521 -0.367887 -0.369539 -0.169521 -0.489196 0.147462 0.172676 0.195775 0.227766 0.208144 0.219778 0.216157 0.213090 0.251475 0.255214 0.252013 0.278579 0.315024 0.381590 0.374564
chargesum: 0.00000
title: Mulliken charges with hydrogens summed into heavy atoms:
elementType: O O O O N C C C C C C C
charge: -0.030974 -0.241971 -0.043402 -0.232756 -0.057784 0.067021 0.060035 0.059708 0.081954 0.018031 0.147462 0.172676
polarizability: 1.07629148e+02 1.80556582e+00 8.67014023e+01 4.01219031e+00 4.96618445e+00 8.79445818e+01
1716.lowfreq: 0.0005 0.0006 0.0009 1.1760 4.7725 9.6926 17.5134 36.3602 44.4953
frequency: 17.4761 36.3060 44.4556 62.0279 83.1465 97.3095 124.4200 166.3095 190.7408 243.6980 285.1628 306.2081 344.3598 442.1240 469.7540 484.2220 501.0682 529.3666 567.4778 587.0915 632.3841 639.3423 716.0292 732.8673 777.2310 802.3114 857.7016 892.8392 938.7035 1018.7695 1036.9010 1052.0089 1069.5154 1079.8700 1092.3114 1116.0995 1155.1848 1191.9506 1211.1931 1241.0076 1244.9702 1267.9192 1283.0073 1289.0837 1293.5976 1329.2807 1365.6977 1372.4674 1381.7500 1436.6274 1456.5004 1468.5381 1483.9091 1606.0647 1662.9745 1668.8080 2899.6678 2960.5855 2984.5663 2988.1399 2994.3537 3017.3874 3030.9471 3051.2266 3064.0294 3499.9169 3510.9325 3518.2282 3644.6882
redmass: 10.2259 5.5014 7.2588 2.7515 3.0140 2.9646 2.9269 3.0934 1.1379 3.7220 4.6671 3.8315 3.5599 4.1687 3.7383 1.6852 1.7997 1.9510 2.6876 4.3875 1.5417 1.3136 4.2275 1.1238 1.5275 2.9079 4.3011 1.6484 2.3366 3.2737 2.2995 2.3250 2.5090 2.1311 2.5244 1.4540 1.2266 1.9246 1.4998 1.4303 1.3596 1.6248 1.3218 1.1486 1.2274 1.4847 1.5444 1.8542 1.8106 1.0849 1.0960 1.0741 1.0989 1.3801 3.3677 8.2003 1.0807 1.0621 1.0615 1.0613 1.0600 1.0953 1.0987 1.1023 1.1032 1.0461 1.0639 1.0641 1.0994
irintensity: 1.6039 0.4333 1.5477 0.1807 1.2108 0.4169 0.8072 0.4240 25.6369 0.8516 3.4711 0.6058 12.5299 12.1594 50.6455 174.4516 31.0353 61.1359 6.6844 3.3190 193.0100 131.7561 17.5197 22.7044 3.1812 4.8942 0.9054 5.7937 5.8931 207.0211 29.1060 227.4292 13.8971 69.2250 20.9269 0.1550 7.1600 4.0849 35.4369 0.4608 1.7364 11.7392 21.3406 2.6210 7.0809 19.3230 2.9114 35.0425 6.0919 29.4914 1.6556 0.7604 15.3938 185.2505 132.1664 204.7636 49.1881 14.9712 6.8965 16.6094 59.0107 2.3964 0.4228 0.9822 83.9353 12.9982 17.2232 27.8877 17.8994
temp: 298.150 k
press: 1.00000 atm
elementType: 8 8 8 8 7 6 6 6 6 6 6 6 1 1 1 1 1 1 1 1 1 1 1 1 1
symmnumber: 1
zpe: 530022.3 jmol-1
zpe.correction: 0.201875 hartree
zpe.thermalcorrener: 0.215974 hartree
zpe.thermalcorrenthalpy: 0.216918 hartree
zpe.thermalcorrgfe: 0.158130 hartree
zpe.sumelectzpe: -629.241328 hartree
zpe.sumelectthermal: -629.227229 hartree
zpe.sumelectthermalent: -629.226284 hartree
zpe.sumelectthermalfe: -629.285072 hartree
dipole: -1.2730 -0.1137 0.3619
dipole: 1.3283
quadrupole: -68.3741 -65.4208 -77.6134
quadrupole: -7.0862 -9.4376 -6.0446
quadrupole: 2.0953 5.0486 -7.1440 -7.0862 -9.4376 -6.0446
hfenergy: -629.4432027 hartree
pointgroup: C01 [X(C7H13N1O4)]
dipole: -0.4985391 -0.0531608 0.1474374 debye
dipolederiv: -0.4188626 0.0379788 0.0378792 0.0220288 -0.6542102 0.5080785 0.0473095 0.4438344 -0.8333717 -0.4557447 -0.0672828 -0.2420807 -0.2350537 -0.5961914 -0.1803533 -0.247885 0.0494437 -0.8614219 -0.8403854 0.3494631 0.4570512 0.3257693 -0.5900096 -0.1931374 0.4119584 -0.1879536 -0.6589206 -0.7082867 -0.1094893 -0.1870517 0.0484805 -0.515785 -0.2949579 0.0286513 -0.309219 -0.7390755 -0.818663 0.0155099 0.0905689 0.0607767 -0.3802659 0.2308124 0.0338492 0.1795057 -0.5825331 -0.0716762 0.0265894 0.0035072 0.068515 0.1351206 -0.0402227 -0.0355305 -0.0312163 0.0308542 0.0286836 0.1050483 -0.0278554 -0.0102939 0.0941564 -0.0267217 -0.0015929 0.0649554 0.0889145 0.0524823 0.0024135 -0.0031524 0.0063272 0.1347886 -0.0470394 0.0286071 -0.044071 0.1107525 0.2963311 -0.2257731 0.0194664 -0.2178174 0.0340039 -0.2347274 -0.074578 -0.3573666 0.406354 -0.3359934 -0.0105186 -0.0676349 -0.097204 0.0988212 -0.0885197 -0.223879 -0.0828253 0.0049892 0.4308727 0.1808919 0.2982555 0.431898 1.085088 -0.1561055 0.3377216 -0.2357082 1.3009793 1.4221498 -0.1564414 -0.0992094 -0.219118 0.6249373 0.6039746 -0.1657221 0.6073629 1.0264859 0.0253568 -0.0357237 0.0006732 -0.0510228 -0.1736089 -0.0465346 -0.0110472 -0.0314541 0.0523593 0.1047545 -0.0142722 -0.0054115 -0.0379663 0.0569566 0.062062 0.0178989 0.047493 -0.0979247 0.0121362 -0.0764032 -0.0259358 -0.0363275 -0.1523932 -0.0710084 0.0031451 -0.0519124 0.0641328 0.037794 0.0249747 -0.0027223 0.0277096 0.0374348 0.1080007 0.0159232 0.0662208 -0.1107572 0.0501527 -0.0249265 0.003254 -0.0383427 -0.1367866 -0.0275619 0.0109298 -0.0226064 0.0638695 0.0466652 0.0119061 -0.0030369 0.0290461 0.0353906 0.0772136 -0.0174664 0.0693774 -0.1242265 -0.0797653 0.0330176 0.104956 0.035615 0.017123 -0.0241741 0.1136649 0.0197384 -0.1213025 0.0725527 0.0030971 -0.0155899 0.0155979 0.0821812 0.0748722 0.032204 0.0489274 -0.0623997 0.0687557 -0.0270447 -0.0057965 0.0055013 -0.087948 -0.0326463 0.0317203 -0.0111261 0.1037738 0.3403159 0.0727045 -0.0600477 0.0358262 0.0759147 -0.0187443 -0.0302437 -0.0469484 0.174047 0.2457545 0.0032074 -0.1264831 -0.0246634 0.2332462 -0.0450509 -0.0763193 0.0096922 0.210129 0.3453694 -0.0731706 -0.0584258 -0.068882 0.200084 -0.06474 -0.0991484 -0.1247743 0.2747998 0.1492504 -0.0457562 -0.0851776 -0.0764001 0.3419515 -0.0727686 -0.1301708 -0.0693696 0.2794928 unknown
polarizability: 107.7646826|1.5906131|86.0601335|3.8107482|4.812593|88.4503165 unknown
InChI: InChI=1S/C7H13NO4/c8-5(7(11)12)3-1-2-4-6(9)10/h5,9,11H,1-4,8H2
charge 0 multiplicity 1
25 atoms
O  -2.999375 -1.380164 1.149374
O  -3.575507 -0.976723 -1.061045
O  4.662482 -0.733866 -0.982144
O  4.198643 0.606532 0.854857
N  -2.718621 1.637795 -0.933257
C  -0.127418 0.207312 -0.082796
C  -1.154689 0.842205 0.874265
C  1.324423 0.397681 0.405396
C  -2.608639 0.856865 0.300466
C  2.341578 -0.255372 -0.549428
C  -3.106775 -0.559918 0.02225
C  3.780919 -0.057048 -0.119111
H  -0.341232 -0.876846 -0.191332
H  -0.259327 0.6648 -1.082958
H  -0.87592 1.896965 1.067991
H  -1.160199 0.315502 1.847412
H  1.551057 1.477111 0.498916
H  1.446753 -0.029147 1.419844
H  -3.267736 1.242224 1.114624
H  2.237276 0.151503 -1.575138
H  2.160935 -1.343875 -0.644989
H  -2.885819 2.63637 -0.818235
H  -3.243038 1.187793 -1.687103
H  -3.347142 -2.28622 0.928402
H  5.59767 -0.577381 -0.677462
