program: Gaussian 09
title: 000009773
version: EM64L-G09RevD.01
frameworkgroup: C1[X(C2H4F3N)]
method: RPBEPBE
basis: SDD
operation: Freq
keyword: #pfreq=noraman
keyword: PBEPBE/SDD
title: #p freq=noraman PBEPBE/SDD
converged: NO YES NO NO
title: Mulliken charges:
elementType: F F F N C C H H H H
charge: -0.173099 -0.178251 -0.178246 -0.559399 -0.453675 0.441180 0.251245 0.251255 0.299490 0.299500
chargesum: 0.00000
title: Mulliken charges with hydrogens summed into heavy atoms:
elementType: F F F N C C
charge: -0.173099 -0.178251 -0.178246 0.039591 0.048825 0.441180
polarizability: 3.18259406e+01 3.38723619e+00 2.88077197e+01 2.46778908e-03 -1.85592641e-03 2.99407992e+01
1716.lowfreq: -15.5434 -0.0007 0.0006 0.0012 2.5020 7.8710 105.4120 199.4143 263.2918
frequency: 105.4000 199.4141 263.2867 355.2192 368.7265 463.7013 469.7380 519.3382 594.8061 737.1639 827.6167 1003.0905 1027.9491 1137.1223 1186.5309 1206.4518 1342.1238 1367.5697 1434.4226 1650.1201 3026.3197 3089.9485 3518.4796 3648.4575
redmass: 2.9097 5.2562 1.5135 1.9134 6.7554 5.2661 8.1150 1.4390 9.4908 7.7584 1.7353 1.9684 9.5989 5.0357 7.2103 1.7441 1.1850 1.3015 1.0846 1.0896 1.0608 1.1041 1.0450 1.1005
irintensity: 0.0001 8.6622 35.5224 34.6296 19.3594 0.6022 1.1866 283.7596 76.5642 54.2819 28.4107 148.9689 219.2056 41.1344 120.1833 53.2233 13.4431 4.1779 11.9688 44.8310 19.2403 10.0228 7.2464 13.3513
temp: 298.150 k
press: 1.00000 atm
elementType: 9 9 9 7 6 6 1 1 1 1
symmnumber: 1
zpe: 176706.4 jmol-1
zpe.correction: 0.067304 hartree
zpe.thermalcorrener: 0.073781 hartree
zpe.thermalcorrenthalpy: 0.074726 hartree
zpe.thermalcorrgfe: 0.037127 hartree
zpe.sumelectzpe: -432.398234 hartree
zpe.sumelectthermal: -432.391756 hartree
zpe.sumelectthermalent: -432.390812 hartree
zpe.sumelectthermalfe: -432.428410 hartree
dipole: -2.0916 0.4160 -0.0007
dipole: 2.1326
quadrupole: -37.2265 -33.6257 -33.1364
quadrupole: 2.6860 0.0037 -0.0013
quadrupole: -2.5636 1.0372 1.5265 2.6860 0.0037 -0.0013
hfenergy: -432.4655374 hartree
pointgroup: C01 [X(C2H4F3N1)]
dipole: 0.831739 -0.1102818 -0.0009498 debye
dipolederiv: -0.8066712 -0.3439064 0.00144 -0.2373359 -0.5730133 0.0009405 0.0010343 0.0009829 -0.3013669 -0.3893142 0.0882034 0.0921997 0.0676279 -0.5091085 -0.2870424 0.0293561 -0.23971 -0.6703308 -0.389537 0.0880767 -0.0931511 0.0679374 -0.5062659 0.2860717 -0.030201 0.2386612 -0.6729509 -0.9562226 0.1070422 0.000393 0.1279432 -0.5728255 0.0012719 0.0002525 0.0012667 -0.2069614 0.4530675 0.1491666 -0.0009674 0.18843 0.2491332 -0.0009531 -0.0011099 -0.0008422 0.073659 1.3432561 0.0620747 0.0000086 0.0994134 1.4644032 0.0001466 -0.0000736 0.0002449 1.5414366 0.0390287 -0.016409 -0.0014309 -0.0235574 0.0445941 -0.091641 -0.0258574 -0.1273393 -0.0119341 0.0390832 -0.0161066 0.001458 -0.0231878 0.0460504 0.0913109 0.0259595 0.1269998 -0.0135338 0.3338088 -0.0587756 0.0911003 -0.1335809 0.1779719 -0.0930515 0.0402671 -0.0513883 0.1314127 0.3335008 -0.059366 -0.0910504 -0.1336899 0.1790605 0.0929465 -0.0396276 0.0511242 0.1305694 unknown
polarizability: 31.3775734|3.5532193|29.2560681|-0.0153545|-0.0005986|29.9408181 unknown
InChI: InChI=1S/C2H4F3N/c3-2(4,5)1-6/h1,6H2
charge 0 multiplicity 1
10 atoms
F  -1.548922 -0.967416 0.00422
F  -0.654722 0.793452 1.133708
F  -0.656598 0.787332 -1.136159
N  2.033924 0.161395 -0.002865
C  0.896234 -0.739218 0.001649
C  -0.47661 -0.041751 0.000855
H  0.92268 -1.396637 -0.88516
H  0.924772 -1.390408 0.892992
H  2.193566 0.695452 0.851773
H  2.191977 0.688799 -0.861912
