program: Gaussian 09
title: 000101109
version: EM64L-G09RevD.01
frameworkgroup: C1[X(C15H20O4)]
method: RPBEPBE
basis: SDD
operation: Freq
keyword: #pfreq=noraman
keyword: PBEPBE/SDD
title: #p freq=noraman PBEPBE/SDD
converged: YES YES NO NO
title: Mulliken charges:
elementType: O O O O C C C C C C C C C C C C C C C H H H H H H H H H H H H H H H H H H H H
charge: -0.475986 -0.437141 -0.215436 -0.459761 0.224616 -0.585995 -0.534252 0.070930 0.238229 0.112725 -0.072684 0.211178 -0.374176 0.247256 -0.728878 -0.368899 -0.879419 -0.383843 -0.724681 0.278564 0.236627 0.232590 0.259571 0.209712 0.241605 0.235667 0.227630 0.296318 0.245810 0.243600 0.248443 0.370677 0.203294 0.214535 0.243736 0.237061 0.214581 0.345512 0.350682
chargesum: 0.00000
title: Mulliken charges with hydrogens summed into heavy atoms:
elementType: O O O O C C C C C C C C C C C C C C C
charge: -0.105309 -0.091629 -0.215436 -0.109079 0.224616 -0.070804 -0.042091 0.070930 0.238229 0.112725 -0.072684 0.211178 -0.164464 0.247256 -0.023975 -0.072581 -0.141566 0.033986 -0.029303
polarizability: 2.31384068e+02 -1.45346685e+01 1.68246495e+02 8.17028636e+00 -1.43596750e+00 1.35884634e+02
1716.lowfreq: -12.6953 -0.0006 -0.0005 0.0002 6.2959 9.5437 33.2929 67.2401 78.8464
frequency: 33.1573 67.1812 78.8432 85.7516 113.4792 125.0813 149.5789 168.9165 191.2012 193.9691 206.8069 214.1591 217.4354 221.9053 245.1800 258.9728 267.0230 285.8034 294.4428 315.5559 333.5890 338.6997 358.4276 374.2608 400.0645 421.2245 450.7346 467.3013 492.1830 508.7059 533.8246 568.4687 620.8184 643.3098 654.5347 699.5064 753.5231 791.1517 807.7805 825.7927 834.8893 856.1322 876.1336 909.2686 915.9635 926.1437 937.6678 940.1035 953.1237 959.7156 968.1054 998.2678 1031.9439 1049.0969 1056.1622 1069.5544 1080.0849 1085.0429 1095.9798 1107.2178 1119.6754 1141.4748 1168.3929 1170.3390 1175.0251 1200.2357 1227.8793 1248.6773 1261.1794 1265.2860 1299.3589 1307.1053 1344.9425 1357.8761 1366.4084 1375.8426 1376.6438 1397.6665 1400.0061 1422.3994 1449.6019 1462.3316 1463.0560 1465.0338 1467.8681 1470.1086 1475.5687 1477.7752 1589.6918 1604.8876 1659.1674 2928.2836 2957.6033 2965.7378 2987.9787 2992.4737 2999.8946 3035.5610 3078.2766 3095.0882 3096.9986 3098.7158 3099.4491 3105.0475 3119.6988 3194.6398 3200.0076 3217.7725 3393.8531 3553.8057 3586.3715
redmass: 4.6916 5.0911 4.7651 5.1643 3.5581 3.9067 1.3789 2.4571 1.5033 1.8093 1.7786 1.2244 1.0895 1.2436 2.7178 2.8742 2.7707 3.3472 2.9886 3.2312 4.7305 6.1964 4.2042 3.3141 4.4534 3.3877 4.7095 3.3236 1.6447 2.2398 3.6962 3.3880 4.1428 3.1773 4.4181 4.4183 4.9218 1.0647 2.7244 4.0253 3.2950 5.5914 1.7747 2.1726 2.0498 2.1393 1.8573 1.5127 2.4692 2.5164 1.8272 5.0204 1.5416 1.5563 1.7511 3.1171 1.7568 1.8927 2.1890 2.0166 1.8504 1.8908 1.8578 1.3269 1.1691 1.8236 2.2427 1.6790 2.0342 2.1773 1.7410 3.3765 1.6593 1.7116 3.2441 1.2979 1.2336 1.3123 1.2700 1.0900 1.2443 1.0634 1.0550 1.0660 1.0634 1.0610 1.0619 1.0821 11.1215 8.6999 8.7401 1.0547 1.0839 1.0383 1.1082 1.0337 1.0360 1.0963 1.0975 1.0988 1.1002 1.0634 1.0870 1.0613 1.1007 1.0958 1.1161 1.1151 1.0643 1.0662 1.0667
irintensity: 0.5312 2.0001 0.4128 1.1698 12.0327 0.3242 86.6613 11.1448 2.5529 1.5990 71.2614 66.6518 19.3201 13.6638 9.0828 9.7863 4.9187 3.2239 7.8498 7.0911 8.0339 12.5250 4.1493 6.2324 8.8221 4.7259 6.2181 48.8511 30.9768 26.2161 4.0017 2.0968 6.6474 10.1532 3.5122 7.8145 3.5062 3.6801 34.5208 6.8688 0.4702 9.0126 17.5811 10.5620 58.2546 33.8584 48.0045 41.5209 53.7976 7.9056 3.5152 40.6278 3.2938 11.7421 5.9378 69.4714 1.9787 26.2781 79.4408 0.6467 21.6121 14.4963 5.2830 0.5932 36.8917 21.2391 42.6494 29.4746 55.4537 16.0376 6.9915 4.1833 10.5695 79.5886 19.7671 5.9024 29.2771 4.2985 18.7430 12.7830 7.2964 5.9177 13.8247 5.3491 9.0359 13.7826 5.8698 12.1108 115.5787 124.0163 28.5907 33.5229 69.4116 34.2574 53.8060 16.6552 30.8933 13.0607 22.0420 18.7938 19.5192 10.1655 21.6041 13.6039 14.1552 1.4670 1.6672 6.3795 42.5689 4.5601 6.1284
temp: 298.150 k
press: 1.00000 atm
elementType: 8 8 8 8 6 6 6 6 6 6 6 6 6 6 6 6 6 6 6 1 1 1 1 1 1 1 1 1 1 1 1 1 1 1 1 1 1 1 1
symmnumber: 1
zpe: 833484.4 jmol-1
zpe.correction: 0.317457 hartree
zpe.thermalcorrener: 0.337513 hartree
zpe.thermalcorrenthalpy: 0.338457 hartree
zpe.thermalcorrgfe: 0.270884 hartree
zpe.sumelectzpe: -882.972472 hartree
zpe.sumelectthermal: -882.952416 hartree
zpe.sumelectthermalent: -882.951472 hartree
zpe.sumelectthermalfe: -883.019045 hartree
dipole: 1.0503 4.2247 -2.0370
dipole: 4.8064
quadrupole: -117.0066 -115.6438 -107.2203
quadrupole: -4.8465 -11.2403 -1.7925
quadrupole: -3.7163 -2.3536 6.0699 -4.8465 -11.2403 -1.7925
hfenergy: -883.2899294 hartree
pointgroup: C01 [X(C15H20O4)]
dipole: -0.428139 -1.7104986 -0.6831116 debye
polarizability: 231.0604628|-15.1992148|168.3651948|-8.7082748|-0.4520333|136.0895397 unknown
InChI: InChI=1S/C15H20O4/c1-8-10-9(6-13(2,7-16)12(10)18)11(17)14(3,19)15(8)4-5-15/h6,12,16,18-19H,4-5,7H2,1-3H3
charge 0 multiplicity 1
39 atoms
O  3.283313 1.588491 -0.154824
O  -1.819977 -1.754247 1.710923
O  0.900688 2.806534 -0.244348
O  -3.9912 1.124051 -1.546466
C  2.139242 -0.583651 -0.420953
C  2.812088 -0.66734 -1.816858
C  3.505982 -1.266894 -0.595271
C  2.153496 0.788491 0.305895
C  0.885134 -1.394567 -0.20436
C  -0.282181 -0.719343 0.053625
C  0.845186 1.565697 0.017571
C  -0.378326 0.75215 0.085693
C  -1.682331 -1.26903 0.315695
C  -2.642247 -0.031615 0.119568
C  2.277875 0.595916 1.842866
C  -1.687328 1.159045 0.139007
C  0.951108 -2.903534 -0.314457
C  -3.274182 -0.133389 -1.298125
C  -3.75652 0.079355 1.184899
H  3.218961 0.267252 -2.209356
H  2.362451 -1.340064 -2.553397
H  3.568631 -2.355037 -0.505767
H  4.370294 -0.717589 -0.211676
H  -1.954831 -2.100638 -0.367641
H  3.240834 0.099718 2.052755
H  2.27279 1.577084 2.348232
H  1.459162 -0.021433 2.251195
H  -2.032915 2.194799 0.150161
H  1.565484 -3.339517 0.497376
H  1.422238 -3.220139 -1.265189
H  -0.049772 -3.365864 -0.270301
H  2.920691 2.507182 -0.319431
H  -3.971158 -0.999732 -1.319418
H  -2.474325 -0.289701 -2.05391
H  -3.325026 0.201489 2.190202
H  -4.402745 0.941604 0.948282
H  -4.374886 -0.835722 1.199038
H  -0.99663 -2.257266 1.93918
H  -4.372968 1.116958 -2.458516
