program: Gaussian 09
title: 000101060
version: EM64L-G09RevD.01
frameworkgroup: C1[X(C5H9BrO3)]
method: RPBEPBE
basis: SDD
operation: Freq
keyword: #p
keyword: freq=noraman
keyword: PBEPBE/SDD
title: #p freq=noraman PBEPBE/SDD
converged: YES YES NO NO
title: Mulliken charges:
elementType: Br O O O C C C C C H H H H H H H H H
charge: 0.004229 -0.252974 -0.236007 -0.131398 0.105777 -0.529124 0.005522 -0.515716 -0.500980 0.206351 0.302505 0.191018 0.208957 0.209386 0.249701 0.241566 0.196974 0.244213
chargesum: 0.00000
title: Mulliken charges with hydrogens summed into heavy atoms:
elementType: Br O O O C C C C C
charge: 0.004229 -0.252974 -0.236007 -0.131398 0.312128 -0.226619 0.196540 0.152329 0.181773
polarizability: 1.01422906e+02 1.06795450e+01 7.24531605e+01 2.24499445e-01 -9.24098258e-01 6.87442883e+01
1716.lowfreq: -6.2461 -5.1994 -0.0005 -0.0003 -0.0002 5.1552 34.2143 53.7210 71.3167
frequency: 34.0794 53.7140 71.3114 87.3542 131.8264 136.8920 151.3230 189.9525 211.3380 275.6804 281.8165 346.8349 444.9822 498.3397 579.1553 751.2616 836.6994 866.6218 897.8759 974.9845 1000.9037 1042.9961 1108.0244 1111.7032 1119.1355 1134.0519 1142.2806 1166.2108 1280.0234 1325.1090 1352.1132 1397.2663 1428.6662 1434.2387 1455.2442 1460.4003 1470.3296 1479.4680 1651.7198 2876.8364 2888.1024 2938.1644 2948.4222 3017.9244 3045.1618 3060.2874 3113.0880 3130.5201
redmass: 3.0965 3.0232 4.5278 3.8037 1.7857 2.3972 1.3433 2.4614 3.4702 5.6041 4.6452 3.8769 4.9964 5.4517 4.2038 5.9761 3.7917 5.2381 2.3340 2.6997 9.5395 3.1334 1.2585 1.2870 1.6012 1.2242 1.3459 2.1042 1.9879 1.2214 1.1885 1.1974 1.1457 1.1366 1.0507 1.0596 1.0532 1.0527 9.0064 1.0825 1.0863 1.0339 1.0400 1.1032 1.0844 1.0935 1.0977 1.1015
irintensity: 4.7844 2.7275 4.1359 5.7412 1.7966 1.0787 0.6157 5.0712 2.8492 7.2255 12.2207 0.9432 26.3621 2.0497 31.1098 43.0204 40.3777 44.9452 11.8908 18.1671 173.2496 44.5006 0.3392 1.7176 58.5867 8.5168 2.0430 63.6374 42.7027 5.1075 20.4089 1.7202 6.7636 5.2721 9.8590 13.3221 15.5387 15.0368 112.9820 64.6864 93.5517 66.0865 68.7561 64.2063 3.3500 38.0981 19.6494 17.4613
temp: 298.150 k
press: 1.00000 atm
elementType: 35 8 8 8 6 6 6 6 6 1 1 1 1 1 1 1 1 1
symmnumber: 1
zpe: 355293.5 jmol-1
zpe.correction: 0.135324 hartree
zpe.thermalcorrener: 0.147027 hartree
zpe.thermalcorrenthalpy: 0.147971 hartree
zpe.thermalcorrgfe: 0.095244 hartree
zpe.sumelectzpe: -434.263945 hartree
zpe.sumelectthermal: -434.252242 hartree
zpe.sumelectthermalent: -434.251298 hartree
zpe.sumelectthermalfe: -434.304025 hartree
dipole: 1.4200 -2.1140 3.7472
dipole: 4.5307
quadrupole: -59.8814 -63.4452 -61.1621
quadrupole: -8.7869 4.5549 6.0130
quadrupole: 1.6148 -1.9490 0.3342 -8.7869 4.5549 6.0130
hfenergy: -434.399269 hartree
pointgroup: C01 [X(C5H9Br1O3)]
dipole: 0.8067706 0.5958688 1.4735598 debye
dipolederiv: -0.3427402 -0.1839933 0.0677498 -0.2185962 -0.3328102 0.1530868 0.1471118 0.1868496 -0.2802067 -0.7540976 -0.4151989 -0.0997143 -0.2314444 -1.0345662 -0.265356 -0.0255083 -0.07389 -0.374359 -0.8079086 0.2606554 0.1621934 0.3114722 -0.7520942 -0.2158405 0.2228347 -0.2300078 -0.4778721 -0.4160796 -0.012184 0.0626535 0.0114038 -0.2416267 0.0509617 0.0422897 0.1963839 -0.8426704 0.8466624 0.2009629 -0.0114611 -0.313784 1.1106413 0.4150609 -0.207741 0.1643976 0.5220033 0.1579151 0.3526288 -0.2987664 0.4334472 0.4769292 -0.227251 -0.3496144 -0.1633088 -0.0829227 0.7525272 -0.1323312 0.1897422 -0.0279873 0.0554923 -0.0559733 0.044395 -0.2975675 1.1111296 0.3720909 0.0783704 0.0922634 0.1456927 0.4911577 0.128727 0.2215828 0.3278563 0.3771764 0.6124389 -0.2340879 -0.1061782 -0.1106875 0.306957 -0.0160876 0.0009569 -0.0489994 0.2929716 -0.0441523 -0.0163136 -0.1274781 0.0451482 -0.0443417 0.0075747 -0.0135041 0.0098202 -0.1952782 0.031502 -0.0065113 0.0090835 0.0032066 -0.0624634 -0.0324536 0.0470292 0.0081303 0.0291236 -0.2719191 0.0254271 -0.0338365 -0.0257795 0.0975612 0.0024002 0.024522 0.0121823 0.0183083 -0.0567134 0.0319969 -0.1004577 0.097941 -0.0334096 0.0923184 -0.1679517 -0.0323865 -0.0481769 -0.0777256 0.1003905 0.1146457 0.0297072 0.0055079 -0.0696191 0.0418877 -0.1573112 -0.0531744 0.0431264 -0.1131058 0.0248942 -0.1026164 -0.0560138 0.033059 0.0427976 0.0571432 0.0622102 0.0646637 0.0187193 0.0084089 0.0608763 -0.0377002 -0.1163592 0.0337412 -0.1155345 0.0323989 -0.0491624 0.0645859 -0.0046805 0.0234828 0.0676485 0.0327528 -0.1293995 0.0972865 -0.1604539 -0.0604277 -0.0200113 0.0509383 -0.1314825 -0.0168691 0.0829986 0.0245706 0.058956 0.0697924 unknown
polarizability: 84.7120687|15.1037118|81.7896359|-9.7181971|-9.666918|76.1186499 unknown
InChI: InChI=1S/C5H9BrO3/c1-8-5(9-2)4(6)3-7/h3-5H,1-2H3
charge 0 multiplicity 1
18 atoms
Br -2.159179 -1.392999 1.373707
O  0.970867 1.18311 0.019024
O  0.658799 -1.137116 -0.419621
O  -1.266755 0.48798 -2.030029
C  0.329243 -0.072355 0.462638
C  -1.190815 0.142241 0.424052
C  -1.85995 0.303407 -0.95123
C  1.479085 2.009247 1.122415
C  2.090057 -1.469545 -0.428064
H  0.665034 -0.289754 1.507999
H  -1.456085 1.015137 1.048504
H  -2.977087 0.263156 -0.889759
H  2.183325 1.441686 1.76555
H  0.660941 2.414012 1.75312
H  2.009314 2.846885 0.644042
H  2.186182 -2.336441 -1.09763
H  2.438251 -1.743329 0.590765
H  2.682474 -0.621621 -0.814282
