program: Gaussian 09
title: 000101055
version: EM64L-G09RevD.01
frameworkgroup: C1[X(C12H11ClO4S)]
method: RPBEPBE
basis: SDD
operation: Freq
keyword: #p
keyword: freq=noraman
keyword: PBEPBE/SDD
title: #p freq=noraman PBEPBE/SDD
converged: YES YES NO NO
title: Mulliken charges:
elementType: Cl S O O O O C C C C C C C C C C C C H H H H H H H H H H H
charge: -0.033149 0.259066 -0.229970 -0.249761 -0.406988 -0.231941 -0.459814 -0.453090 0.272584 -0.475563 0.102745 -0.254374 0.227370 -0.192832 -0.374938 0.186888 -0.206520 -0.522525 0.306726 0.256002 0.286727 0.279454 0.268284 0.266679 0.261777 0.233829 0.283648 0.216172 0.383513
chargesum: 0.00000
title: Mulliken charges with hydrogens summed into heavy atoms:
elementType: Cl S O O O O C C C C C C C C C C C C
charge: -0.033149 0.259066 -0.229970 -0.249761 -0.023476 -0.231941 -0.153088 0.089639 0.272584 0.072175 0.102745 -0.254374 0.227370 -0.192832 -0.108259 0.186888 0.055258 0.211124
polarizability: 2.18316276e+02 -2.14976218e-01 2.08242858e+02 -1.49859540e+01 -4.01268225e+00 9.33327136e+01
1716.lowfreq: -5.0152 0.0015 0.0020 0.0025 5.4025 10.2710 31.6471 38.2244 52.5036
frequency: 31.6398 38.2093 52.4468 69.8327 93.2612 100.8758 139.2331 152.6174 166.8838 197.1676 220.0673 238.7651 250.3652 284.6659 292.1985 326.1641 327.6999 370.4114 388.9530 427.1514 442.4300 480.1454 495.9319 505.4531 529.6899 570.0194 583.4665 589.4234 607.0678 643.2429 652.9610 692.8245 743.7160 782.4295 822.9562 833.6942 866.1473 888.1811 942.1083 950.5897 983.9142 1023.1963 1046.7668 1066.1904 1108.6484 1119.6170 1134.9228 1143.1529 1154.4610 1163.4921 1189.3918 1232.4159 1240.9343 1259.7096 1268.3118 1292.0549 1334.6643 1350.4656 1357.3532 1369.6414 1396.5953 1417.1974 1437.4056 1442.9450 1451.5589 1471.7204 1537.5969 1567.2742 1578.6247 1661.9847 2980.4673 2981.6012 2997.0684 3036.8253 3050.6568 3060.3576 3092.6595 3125.2435 3165.1673 3185.7974 3513.9604
redmass: 7.2492 12.0425 6.3630 5.0663 4.9922 5.6971 3.6978 6.1459 4.9378 1.6242 4.9677 5.6770 3.5913 3.2951 5.6758 5.2300 8.7692 4.1219 7.4127 4.7659 6.0792 5.2312 3.2584 2.5922 3.3384 5.3757 4.7298 4.5054 4.3741 1.4765 5.4904 4.9354 5.1790 6.1593 1.5739 6.6988 4.3655 2.0569 2.2105 1.3442 8.2340 5.7326 3.2394 2.5797 1.2435 1.8487 1.6862 1.7509 1.2744 1.4418 1.2957 2.8327 1.9437 2.5980 1.4810 1.2854 4.2268 1.9006 5.5419 2.0106 1.9727 1.0931 1.0885 1.2871 1.1854 1.0855 6.3553 9.6694 7.3946 8.2608 1.0324 1.0614 1.0618 1.0877 1.0981 1.0953 1.0993 1.1053 1.0886 1.0976 1.0641
irintensity: 1.2850 0.8983 0.5431 1.4994 1.7968 0.1986 6.3769 3.3421 6.4089 0.8182 1.7809 2.9636 3.0635 3.8188 1.7279 3.2409 2.8766 0.7265 5.3639 12.8592 8.3277 14.0926 16.5419 18.5137 39.6351 24.2141 1.6989 3.3104 6.6833 113.2015 44.7766 5.0369 1.0447 22.6135 42.8880 37.3231 4.3961 5.1961 22.3976 1.2066 34.5702 86.9132 203.6974 82.2389 1.6487 31.9482 3.5180 5.8802 3.6358 3.8953 6.6221 85.9376 110.2072 100.7500 3.0381 17.8260 45.5775 34.7536 19.7036 94.6087 108.0927 9.4165 32.0923 73.8356 21.7233 59.2376 96.3752 160.0457 49.7489 181.7831 41.6224 5.1948 11.9184 1.5272 0.6190 8.1843 25.1369 19.3994 0.7458 2.3204 34.5624
temp: 298.150 k
press: 1.00000 atm
elementType: 17 16 8 8 8 8 6 6 6 6 6 6 6 6 6 6 6 6 1 1 1 1 1 1 1 1 1 1 1
symmnumber: 1
zpe: 543003.5 jmol-1
zpe.correction: 0.206819 hartree
zpe.thermalcorrener: 0.224255 hartree
zpe.thermalcorrenthalpy: 0.225199 hartree
zpe.thermalcorrgfe: 0.160161 hartree
zpe.sumelectzpe: -1621.564320 hartree
zpe.sumelectthermal: -1621.546884 hartree
zpe.sumelectthermalent: -1621.545940 hartree
zpe.sumelectthermalfe: -1621.610978 hartree
dipole: -2.2839 -0.0965 -1.8234
dipole: 2.9241
quadrupole: -98.4131 -126.1161 -121.9265
quadrupole: 2.2955 -3.5915 -5.9394
quadrupole: 17.0722 -10.6309 -6.4413 2.2955 -3.5915 -5.9394
hfenergy: -1621.7711389 hartree
pointgroup: C01 [X(C12H11Cl1O4S1)]
dipole: -0.8802784 0.0423627 -0.7394341 debye
polarizability: 218.6327592|-2.3578281|207.8184557|-12.736593|-9.0561304|93.4406329 unknown
InChI: InChI=1S/C12H11ClO4S/c1-17-9-3-2-7(13)12-11(9)8(14)4-6(18-12)5-10(15)16/h2-3,6,15H,4-5H2,1H3
charge 0 multiplicity 1
29 atoms
Cl 1.945589 -3.832489 0.134296
S  -0.596287 -1.955323 0.412385
O  0.517639 2.25832 1.328822
O  2.887557 2.073185 -0.425135
O  -5.391458 -0.204717 -0.331345
O  -3.744642 1.202175 -1.168801
C  -1.64446 -0.442381 -0.064133
C  -1.269105 0.718308 0.855803
C  1.227932 0.259705 0.179921
C  -3.116529 -0.870901 0.042793
C  0.196864 1.154661 0.787662
C  1.038257 -1.1726 0.18897
C  2.538239 0.756125 -0.166632
C  2.153443 -2.0221 0.051804
C  3.636049 -0.132077 -0.292116
C  -4.059875 0.161913 -0.550346
C  3.451443 -1.514699 -0.156027
C  1.922837 3.06822 -0.91897
H  -1.394206 -0.203876 -1.113051
H  -1.493007 0.456805 1.910137
H  -1.871714 1.612558 0.608802
H  -3.290488 -1.823912 -0.495064
H  -3.407603 -1.054624 1.094124
H  4.616549 0.290941 -0.524698
H  4.295498 -2.203012 -0.254041
H  2.523663 3.757023 -1.53285
H  1.454752 3.589722 -0.069774
H  1.140435 2.586384 -1.535663
H  -5.995672 0.473567 -0.739773
