program: Gaussian 09
title: 000101071
version: EM64L-G09RevD.01
frameworkgroup: C1[X(C11H10Cl3NO4)]
method: RPBEPBE
basis: SDD
operation: Freq
keyword: #p
keyword: freq=noraman
keyword: PBEPBE/SDD
title: #p freq=noraman PBEPBE/SDD
converged: YES YES NO NO
title: Mulliken charges:
elementType: Cl Cl Cl O O O O N C C C C C C C C C C C H H H H H H H H H H
charge: 0.096493 0.108709 0.107799 -0.281208 -0.442748 -0.190047 -0.273372 -0.379245 -0.343400 0.531185 -0.385950 -0.401588 0.165414 -0.217005 -0.221039 0.304885 -0.237856 -0.187599 -0.555183 0.292080 0.368143 0.249534 0.242900 0.228296 0.232439 0.233176 0.288716 0.271712 0.394761
chargesum: 0.00000
title: Mulliken charges with hydrogens summed into heavy atoms:
elementType: Cl Cl Cl O O O O N C C C C C C C C C C C
charge: 0.096493 0.108709 0.107799 -0.281208 -0.047987 -0.190047 -0.273372 -0.011102 -0.051320 0.531185 -0.136416 -0.158689 0.165414 0.011291 0.011400 0.304885 -0.004681 0.372829 -0.555183
polarizability: 1.85146724e+02 8.17563174e+00 1.55292261e+02 -9.21331030e-01 1.01974742e+01 1.53280543e+02
1716.lowfreq: -11.6100 -6.4842 -3.6058 -0.0017 -0.0005 0.0019 11.9585 18.2653 21.3008
frequency: 11.5934 18.1582 21.2239 36.8188 42.8619 54.7143 77.1591 100.1401 103.8531 158.4760 182.0357 188.9297 222.7173 233.1056 263.0256 266.6645 296.1023 321.2263 345.1582 357.5312 400.6450 414.2315 486.9580 514.3253 519.3879 569.6347 607.8128 608.5103 616.7405 624.8245 637.0468 668.0450 693.8493 696.9793 705.4974 735.3281 769.4104 824.3685 848.4561 854.5784 911.9906 929.7534 978.7024 991.0581 998.5913 1000.9594 1025.9912 1053.1837 1072.4517 1076.6914 1090.2031 1111.6330 1174.6403 1182.9774 1191.9762 1200.2894 1256.6233 1258.1974 1289.8029 1308.9615 1346.1117 1358.2336 1388.9123 1435.9630 1447.2147 1471.6749 1480.4472 1596.7584 1609.3657 1683.3142 1690.2253 3020.8093 3061.3588 3101.7079 3125.3314 3131.5657 3141.5210 3152.3054 3167.7317 3527.8941 3563.4656
redmass: 9.1900 9.4203 4.1011 14.7162 9.9378 10.6724 12.4157 6.3871 7.7457 14.8246 6.6765 9.0756 8.1867 8.8811 16.8824 12.1713 6.1610 5.7719 6.7529 4.1691 2.7963 5.7864 3.5057 3.9726 5.2636 3.2126 3.0928 1.3692 2.5573 3.2928 3.8315 6.2004 6.6078 6.2228 1.7109 10.6548 2.1120 5.6060 2.6885 1.5178 5.2334 1.5138 1.4020 6.1635 2.4316 2.1049 2.3413 2.1908 2.1598 4.1971 1.8788 5.0695 1.0864 2.2563 1.1244 2.7797 1.4368 1.0999 1.9737 1.4461 1.2887 1.2686 5.1330 1.0798 2.1026 1.8873 2.2012 6.0647 6.0378 9.7437 10.0340 1.0578 1.0849 1.1062 1.0857 1.0875 1.0923 1.0965 1.1016 1.0644 1.0780
irintensity: 0.0544 0.0051 0.2340 0.5857 1.1685 3.7899 3.0823 0.6240 0.5357 0.6501 0.0873 1.3497 2.0341 1.0542 0.1403 9.2207 0.7608 3.9283 2.5526 6.1236 0.4323 35.3222 4.6697 48.8729 11.4323 51.5245 39.3859 45.3611 93.1626 41.4490 129.8274 50.9328 60.1937 5.8224 85.1221 137.2998 59.6589 17.7420 15.5669 7.1811 80.7392 16.1007 0.1541 8.7914 161.0781 119.6413 4.0166 22.2992 77.8733 37.4145 144.0701 96.6091 1.3937 67.1822 0.4450 107.2370 3.9221 19.0667 57.3181 29.9645 9.0711 12.0378 1.2308 11.5342 12.7165 453.5065 32.7800 1.6819 1.9805 234.7464 243.5093 32.3526 4.5670 1.7928 1.7508 0.0218 11.7605 28.2602 20.0002 37.0601 72.1124
temp: 298.150 k
press: 1.00000 atm
elementType: 17 17 17 8 8 8 8 7 6 6 6 6 6 6 6 6 6 6 6 1 1 1 1 1 1 1 1 1 1
symmnumber: 1
zpe: 518609.4 jmol-1
zpe.correction: 0.197528 hartree
zpe.thermalcorrener: 0.216804 hartree
zpe.thermalcorrenthalpy: 0.217748 hartree
zpe.thermalcorrgfe: 0.144208 hartree
zpe.sumelectzpe: -2159.601153 hartree
zpe.sumelectthermal: -2159.581876 hartree
zpe.sumelectthermalent: -2159.580932 hartree
zpe.sumelectthermalfe: -2159.654473 hartree
dipole: -2.4976 -0.2069 3.0116
dipole: 3.9180
quadrupole: -132.2444 -121.7607 -129.3592
quadrupole: 2.9099 -7.7136 5.9473
quadrupole: -4.4563 6.0274 -1.5710 2.9099 -7.7136 5.9473
hfenergy: -2159.7986804 hartree
pointgroup: C01 [X(C11H10Cl3N1O4)]
dipole: -0.8471183 -0.5730223 1.1533138 debye
polarizability: 184.3982633|10.47529|148.7309531|-0.4654831|7.089299|160.590311 unknown
InChI: InChI=1S/C11H10Cl3NO4/c12-11(13,14)6-19-10(18)15-8(9(16)17)7-4-2-1-3-5-7/h1-5,8,15-16H,6H2
charge 0 multiplicity 1
29 atoms
Cl 5.825395 -0.719558 -1.479607
Cl 5.051754 0.409386 1.223845
Cl 3.986514 1.698287 -1.302593
O  2.147993 -0.346801 0.263454
O  -1.275918 2.246573 1.915051
O  -2.527262 3.082465 0.13797
O  0.838695 -0.257338 -1.716187
N  0.088277 0.606158 0.334066
C  -1.245458 0.986558 -0.156429
C  -2.28374 -0.148143 -0.060674
C  -2.666922 -0.67841 1.197054
C  -2.84789 -0.677995 -1.244507
C  -1.756175 2.219333 0.592457
C  -3.60461 -1.731129 1.265545
C  -3.787424 -1.731195 -1.174632
C  0.984765 -0.006967 -0.496069
C  -4.168175 -2.259159 0.079904
C  3.262049 -0.890134 -0.505939
C  4.447167 0.087186 -0.504514
H  -1.148914 1.275803 -1.216965
H  0.330647 0.773919 1.312165
H  -2.234149 -0.270474 2.118219
H  -2.542714 -0.277317 -2.217779
H  -3.897978 -2.13865 2.23936
H  -4.216822 -2.139903 -2.09571
H  -4.896445 -3.075872 0.134301
H  2.945316 -1.081027 -1.548149
H  3.579686 -1.826595 -0.018001
H  -1.64106 3.039198 2.392368
