program: Gaussian 09
title: 000101037
version: EM64L-G09RevD.01
frameworkgroup: C1[X(C14H11FO)]
method: RPBEPBE
basis: SDD
operation: Freq
keyword: #p
keyword: freq=noraman
keyword: PBEPBE/SDD
title: #p freq=noraman PBEPBE/SDD
converged: YES YES NO NO
title: Mulliken charges:
elementType: F O C C C C C C C C C C C C C C H H H H H H H H H H H
charge: -0.186840 -0.217704 0.135817 0.446512 -0.497184 0.021350 0.322780 0.192698 -0.353202 -0.353816 -0.806174 -0.333903 -0.351338 -0.239519 -0.233410 -0.227561 0.272963 0.240754 0.257023 0.238363 0.225746 0.235204 0.244018 0.271787 0.230699 0.232583 0.232353
chargesum: 0.00000
title: Mulliken charges with hydrogens summed into heavy atoms:
elementType: F O C C C C C C C C C C C C C C
charge: -0.186840 -0.217704 0.135817 0.446512 -0.224221 0.021350 0.322780 0.192698 -0.112449 -0.096793 -0.106860 -0.089885 -0.079551 -0.008820 -0.000826 0.004793
polarizability: 2.28455205e+02 2.00542727e+00 1.42789671e+02 7.38048908e+00 -1.15361965e+01 9.16282317e+01
1716.lowfreq: -7.5258 -4.1862 -0.0002 0.0007 0.0009 7.0822 34.5303 50.3265 59.8062
frequency: 34.5259 50.2898 59.7028 84.2901 123.1166 141.0599 179.7861 196.5444 242.7938 303.5400 336.6176 360.3871 398.7400 404.4034 433.0965 452.3423 472.9400 514.9529 592.8074 613.4370 634.9563 676.3750 693.7308 699.4911 727.6922 744.8087 808.6496 821.1899 838.6808 859.1295 910.0168 945.4262 956.2418 961.0970 988.1100 990.1166 1004.6222 1009.7909 1027.3000 1050.4108 1083.7081 1096.8793 1141.9398 1174.1390 1187.4609 1190.9409 1222.6708 1251.7834 1293.0670 1318.1326 1376.3347 1387.6985 1395.3992 1401.8329 1435.4619 1472.8169 1475.7826 1477.4260 1479.0220 1539.2273 1588.0700 1591.1233 1609.1322 1617.2491 2979.7240 3061.8181 3091.2396 3128.3802 3136.5309 3138.4117 3144.5638 3149.0702 3159.3090 3169.5231 3173.1233
redmass: 5.9876 4.2549 1.0189 4.5013 6.4383 5.6684 5.2715 4.7086 5.1097 5.6033 4.6702 4.7703 4.1296 3.0338 4.2129 6.6794 4.0579 3.5949 4.8601 6.4518 7.4012 4.4105 4.4906 1.9088 5.1021 2.5579 2.8854 1.3725 5.4748 1.2474 1.4423 1.4728 1.5251 2.2461 1.4723 4.9289 1.3428 1.7248 2.0591 1.5519 1.6884 2.8404 1.4529 1.0584 1.1328 2.1652 3.8254 1.7591 2.3502 1.3484 9.1377 9.2912 3.0815 1.2632 2.2879 1.4310 1.0599 2.2046 1.8993 10.3987 6.3574 6.8044 6.0686 6.9101 1.0390 1.0950 1.0999 1.0851 1.0899 1.0881 1.0918 1.0925 1.0963 1.1013 1.0958
irintensity: 3.4439 1.0382 0.4633 1.0545 1.1247 0.4880 2.5639 2.2474 0.7578 1.4831 2.8318 0.7315 2.3424 1.4412 1.7098 7.7451 1.7436 19.3194 5.4139 0.3245 26.8806 3.9931 10.4931 54.9525 14.8678 31.4552 19.1977 47.3048 13.6206 2.5286 3.5833 2.4426 5.6556 24.0256 1.3461 2.2900 0.9457 0.9026 3.9943 15.8436 13.6288 24.4920 9.6920 0.9450 22.6102 29.4846 58.4603 21.0482 211.5680 12.7774 0.1193 4.0062 66.7828 25.0211 25.0979 45.7356 13.9544 27.7331 10.7825 153.0918 2.7101 23.4473 34.3976 23.2455 31.4322 20.0642 14.7353 0.1875 12.2127 4.8037 3.6064 19.7582 21.1638 22.6588 4.3408
temp: 298.150 k
press: 1.00000 atm
elementType: 9 8 6 6 6 6 6 6 6 6 6 6 6 6 6 6 1 1 1 1 1 1 1 1 1 1 1
symmnumber: 1
zpe: 541203.8 jmol-1
zpe.correction: 0.206134 hartree
zpe.thermalcorrener: 0.219946 hartree
zpe.thermalcorrenthalpy: 0.220890 hartree
zpe.thermalcorrgfe: 0.164363 hartree
zpe.sumelectzpe: -714.046660 hartree
zpe.sumelectthermal: -714.032848 hartree
zpe.sumelectthermalent: -714.031903 hartree
zpe.sumelectthermalfe: -714.088431 hartree
dipole: 1.3739 -1.9937 2.1940
dipole: 3.2675
quadrupole: -67.7302 -94.6787 -94.0862
quadrupole: -0.7920 1.3946 -0.6817
quadrupole: 17.7682 -9.1803 -8.5878 -0.7920 1.3946 -0.6817
hfenergy: -714.2527937 hartree
pointgroup: C01 [X(C14H11F1O1)]
dipole: -0.5501726 -0.6742719 0.946158 debye
polarizability: 225.4749233|20.0574462|91.9076064|5.5507569|4.4652246|145.4905772 unknown
InChI: InChI=1S/C14H11FO/c1-10-7-8-13(15)12(9-10)14(16)11-5-3-2-4-6-11/h2-9H,1H3
charge 0 multiplicity 1
27 atoms
F  -0.243898 1.427918 1.419639
O  0.458473 0.005332 -2.348595
C  -0.880115 -0.114184 -0.368478
C  -3.21907 -0.952184 -0.418177
C  -1.923124 -0.864817 -0.975746
C  0.451203 -0.052874 -1.079361
C  1.735884 -0.124267 -0.313156
C  -1.206493 0.591976 0.811214
C  -3.483114 -0.232912 0.778483
C  -2.483255 0.549922 1.393434
C  -4.294838 -1.801551 -1.071707
C  1.810859 -0.673906 0.994037
C  2.926909 0.311246 -0.955734
C  3.056219 -0.784803 1.647083
C  4.167206 0.215372 -0.296116
C  4.235006 -0.334771 1.007613
H  -1.689117 -1.378619 -1.914916
H  -4.482878 -0.273006 1.226052
H  -2.683424 1.134809 2.295924
H  -4.280541 -2.835913 -0.676986
H  -5.302999 -1.392456 -0.884061
H  -4.15024 -1.865209 -2.163931
H  0.902817 -1.031692 1.490722
H  2.85182 0.715962 -1.970416
H  3.109248 -1.218463 2.651529
H  5.079819 0.563718 -0.791781
H  5.200544 -0.413831 1.519931
