program: Gaussian 09
title: 000101043
version: EM64L-G09RevD.01
frameworkgroup: C1[X(C13H27NO)]
method: RPBEPBE
basis: SDD
operation: Freq
keyword: #p
keyword: freq=noraman
keyword: PBEPBE/SDD
title: #p freq=noraman PBEPBE/SDD
converged: NO YES NO NO
title: Mulliken charges:
elementType: O N C C C C C C C C C C C C C H H H H H H H H H H H H H H H H H H H H H H H H H H H
charge: -0.284459 -0.430390 0.257092 -0.066491 -0.065699 0.171657 -0.804309 -0.760977 -0.737371 -0.751915 -0.739905 0.317291 -0.756274 -0.696403 -0.696200 0.204598 0.173890 0.202104 0.225493 0.258207 0.218886 0.220847 0.218737 0.233693 0.202042 0.233881 0.211233 0.228732 0.225926 0.238274 0.207928 0.216220 0.307848 0.217397 0.228539 0.216435 0.271052 0.201738 0.203243 0.201438 0.203943 0.272031
chargesum: 0.00000
title: Mulliken charges with hydrogens summed into heavy atoms:
elementType: O N C C C C C C C C C C C C C
charge: -0.284459 -0.122543 0.257092 0.138107 0.108191 0.171657 -0.118505 -0.102506 -0.067755 -0.086025 -0.077484 0.317291 -0.093904 -0.020370 -0.018788
polarizability: 1.64830526e+02 -5.15464394e-01 1.45213513e+02 -5.76747426e-01 -1.11541037e+00 1.40542818e+02
1716.lowfreq: -16.5275 -5.7005 0.0001 0.0004 0.0009 4.1209 34.5278 53.2065 58.1246
frequency: 33.2908 53.1667 57.6805 84.2280 111.7045 120.4568 165.2176 169.7326 176.9526 198.2718 203.8515 215.4205 221.8747 242.6915 245.9668 255.5028 262.7697 292.8186 302.3707 315.3297 336.9285 348.3368 351.7515 378.2129 394.0226 415.2998 427.1419 448.8829 459.4101 485.6952 509.0573 530.3754 589.7100 710.9521 733.3386 782.8519 829.4731 876.5301 901.7587 911.7104 914.0215 918.4864 921.4823 924.2456 928.4784 950.9025 954.9666 963.1119 1008.4120 1031.5831 1038.4076 1052.5296 1089.1752 1118.0224 1128.9046 1161.6785 1170.7069 1185.0133 1201.7962 1212.6493 1229.7165 1234.3234 1263.6792 1298.5919 1307.0894 1324.1289 1337.1362 1366.4617 1370.6641 1377.5784 1380.9949 1384.3418 1393.7602 1398.0938 1401.9155 1448.0918 1453.9072 1459.0350 1465.4823 1467.1859 1468.5153 1469.0045 1472.3125 1475.4996 1482.3975 1484.3095 1486.0757 1488.9860 1490.1629 1494.7974 1502.2827 1504.2072 1587.4306 2942.5280 2966.1474 2970.1587 2974.0473 2977.6524 2979.7306 2981.5081 2982.2873 2984.1708 3000.5080 3061.6417 3062.1443 3065.7069 3068.8418 3071.2417 3071.4358 3072.7206 3077.1153 3078.3718 3083.8327 3090.2541 3090.4321 3094.9910 3103.8997 3107.8286 3118.2620 3538.8021
redmass: 3.1636 3.2495 2.0997 2.1435 3.5976 3.3831 1.2527 2.2502 3.0357 1.0468 1.1771 2.4689 1.2882 1.1282 1.0728 1.0663 1.0528 2.5259 2.6551 2.6123 2.3806 2.9314 2.2276 2.9652 3.0512 2.7066 2.5618 2.4266 2.6745 2.7293 3.1664 1.1868 2.6095 4.8773 3.6295 2.8806 2.8285 3.1174 2.3184 1.2208 1.6687 1.8736 1.4343 1.6601 1.7139 1.2086 1.4044 1.4128 1.8211 1.3858 1.4541 1.4988 2.1364 2.3176 2.1122 2.1910 2.1359 2.3098 2.6286 2.4489 2.5827 3.0486 3.1358 1.3759 1.3889 1.4222 1.3551 1.2079 1.2109 1.2057 1.2049 1.2012 1.2213 1.1993 1.1934 1.0544 1.2664 1.0918 1.0548 1.0471 1.0517 1.0478 1.0493 1.0491 1.0508 1.0605 1.1176 1.0530 1.2028 1.0671 1.0630 1.0555 5.6455 1.0807 1.0829 1.0362 1.0357 1.0357 1.0355 1.0363 1.0371 1.0363 1.0384 1.1001 1.0988 1.0994 1.0989 1.0983 1.0994 1.0999 1.0992 1.0998 1.0990 1.0984 1.0978 1.0978 1.0998 1.0993 1.0959 1.0768
irintensity: 1.4389 0.8501 0.0350 0.4642 5.3284 2.2287 0.2845 1.3056 0.5959 0.1622 0.3132 1.8727 0.7189 0.3908 0.2867 0.0276 0.0481 0.3740 0.4116 0.8152 0.9726 9.5131 0.3686 2.8639 2.2580 1.1930 0.7764 1.6512 0.3993 2.8608 8.0145 73.6357 4.1979 2.6774 0.7876 1.3431 6.1028 9.5481 0.8485 3.2506 0.2934 4.5675 2.2734 3.3086 1.8075 0.6697 0.1684 0.4942 5.3702 0.1244 1.9500 10.3550 11.9085 8.3436 13.0615 2.4768 0.6403 10.8821 3.3199 6.2278 86.5339 21.4215 66.1248 0.7601 0.2969 1.7929 9.5260 32.1005 42.7534 9.5598 15.4684 36.1687 40.7010 45.8552 4.2342 4.9999 130.4831 23.2285 3.0131 8.2021 3.8882 1.2426 2.5850 5.8067 10.2589 9.4844 34.4652 9.9845 62.8072 11.7344 23.7929 5.2311 112.7047 42.8352 21.1663 21.3436 35.5491 32.8286 37.8391 42.1233 23.7229 22.9954 31.3794 26.3509 1.6595 1.0945 47.9733 72.9719 43.0603 41.2904 44.2913 35.3005 45.3109 24.9599 64.7896 32.3540 2.1734 16.1853 12.5340 7.3913
temp: 298.150 k
press: 1.00000 atm
elementType: 8 7 6 6 6 6 6 6 6 6 6 6 6 6 6 1 1 1 1 1 1 1 1 1 1 1 1 1 1 1 1 1 1 1 1 1 1 1 1 1 1 1
symmnumber: 1
zpe: 989369.9 jmol-1
zpe.correction: 0.376831 hartree
zpe.thermalcorrener: 0.396651 hartree
zpe.thermalcorrenthalpy: 0.397595 hartree
zpe.thermalcorrgfe: 0.330733 hartree
zpe.sumelectzpe: -640.322915 hartree
zpe.sumelectthermal: -640.303095 hartree
zpe.sumelectthermalent: -640.302151 hartree
zpe.sumelectthermalfe: -640.369013 hartree
dipole: 0.1821 -0.9104 3.5145
dipole: 3.6351
quadrupole: -91.0223 -96.2561 -102.1835
quadrupole: 1.0662 -2.8844 0.8293
quadrupole: 5.4650 0.2312 -5.6962 1.0662 -2.8844 0.8293
hfenergy: -640.6997461 hartree
pointgroup: C01 [X(C13H27N1O1)]
dipole: 0.0326179 -0.1024208 1.4261117 debye
polarizability: 164.8416967|0.4615799|144.6639053|0.3563056|-1.8714066|141.0812551 unknown
InChI: InChI=1S/C13H27NO/c1-9(2)13(8,10(3)4)11(15)14-12(5,6)7/h9-10,14H,1-8H3
charge 0 multiplicity 1
42 atoms
O  -0.556061 0.062982 -1.929767
N  -1.077244 -0.164137 0.319864
C  1.340851 0.061616 -0.321333
C  1.647449 1.539877 0.19484
C  1.704924 -1.018588 0.777531
C  -0.172965 -0.027236 -0.718622
C  2.170276 -0.184206 -1.610167
C  1.110172 1.888944 1.606499
C  1.174369 2.629185 -0.802044
C  3.190313 -0.963984 1.216065
C  1.347289 -2.464539 0.346163
C  -2.568144 -0.232317 0.17787
C  -3.136919 -0.380285 1.609942
C  -3.09761 1.072898 -0.47231
C  -2.962277 -1.463072 -0.681056
H  2.754972 1.599708 0.243513
H  1.108249 -0.798007 1.689138
H  3.231305 0.077598 -1.448792
H  2.113159 -1.23761 -1.932597
H  1.774551 0.415059 -2.443624
H  1.458428 2.899727 1.889888
H  1.462632 1.192847 2.388821
H  0.004571 1.910206 1.62339
H  0.071978 2.644862 -0.884822
H  1.502892 3.626203 -0.45305
H  1.58097 2.474845 -1.815116
H  3.378252 -1.716927 2.004405
H  3.863942 -1.1942 0.371339
H  3.475528 0.022638 1.621734
H  0.305846 -2.543951 -0.013581
H  1.46793 -3.156436 1.200856
H  2.013129 -2.820015 -0.460672
H  -0.706695 -0.260061 1.266641
H  -2.863733 0.487111 2.240847
H  -4.238309 -0.437593 1.572427
H  -2.766385 -1.304072 2.09419
H  -2.660882 1.200384 -1.475948
H  -2.833776 1.950802 0.145925
H  -4.198427 1.028864 -0.564013
H  -2.606212 -2.398157 -0.210259
H  -4.062069 -1.519172 -0.778252
H  -2.519268 -1.379992 -1.686564
