program: Gaussian 09
title: 000100956
version: EM64L-G09RevD.01
frameworkgroup: C1[X(C12H22Cl2O)]
method: RPBEPBE
basis: SDD
operation: Freq
keyword: #p
keyword: freq=noraman
keyword: PBEPBE/SDD
title: #p freq=noraman PBEPBE/SDD
converged: YES YES NO NO
title: Mulliken charges:
elementType: Cl Cl O C C C C C C C C C C C C H H H H H H H H H H H H H H H H H H H H H H
charge: -0.003775 -0.052071 -0.077273 -0.385071 -0.387140 -0.382054 -0.380374 -0.372847 -0.384542 -0.353297 -0.339897 -0.356568 -0.424898 -0.696123 0.017420 0.196151 0.194125 0.199088 0.195446 0.192749 0.193758 0.204552 0.196937 0.190461 0.189638 0.224204 0.198817 0.187862 0.188324 0.235824 0.245642 0.195211 0.194715 0.319686 0.209627 0.210010 0.215683
chargesum: 0.00000
title: Mulliken charges with hydrogens summed into heavy atoms:
elementType: Cl Cl O C C C C C C C C C C C C
charge: -0.003775 -0.052071 -0.077273 0.005205 0.007393 0.004453 0.021114 0.007251 0.038480 0.022889 0.141570 0.033359 -0.105212 -0.060802 0.017420
polarizability: 2.02946210e+02 -7.43234353e-01 1.41071933e+02 -8.85977093e+00 -5.08935428e+00 1.22051808e+02
1716.lowfreq: -15.1099 -5.3410 -0.0028 -0.0020 -0.0019 5.3051 10.0834 24.3770 29.0378
frequency: -4.3888 24.3636 28.3713 37.3505 43.6226 65.1397 80.6828 86.7917 106.8670 121.3111 137.5519 141.3251 147.3711 156.3618 177.3877 222.5598 235.4595 245.4817 302.7454 316.2221 401.8975 402.5455 421.3874 479.1427 495.4429 550.9623 672.1011 710.3783 720.0838 723.2005 732.4931 754.5964 794.8087 845.2191 888.1545 896.5373 927.0904 973.2010 982.8568 994.7281 1017.9898 1022.4894 1047.0857 1054.1919 1074.1531 1079.0279 1081.1859 1085.3235 1121.5558 1133.2743 1179.8765 1184.7689 1210.2803 1211.0615 1238.9773 1244.8934 1265.3540 1275.2748 1279.6784 1286.3558 1289.4053 1297.0314 1299.9979 1302.8209 1322.8351 1335.6181 1346.5151 1352.3541 1355.9078 1357.0945 1389.7173 1456.2068 1459.8082 1460.4768 1463.5103 1464.3352 1469.8173 1475.7052 1477.6349 1481.2529 1486.0024 1488.9352 1733.9328 2949.6610 2950.2756 2952.3550 2955.0625 2959.0857 2963.4794 2967.7070 2971.3825 2971.5475 2982.5816 2987.9672 2995.5194 3004.4939 3008.9695 3015.4881 3026.3215 3036.5597 3044.4942 3067.9687 3070.4084 3075.2488 3108.3564
redmass: 3.0530 7.0025 2.1917 6.6820 4.1301 1.6361 4.3551 3.7100 1.6445 3.5992 3.4459 1.8618 5.2874 2.3295 7.4893 4.3037 1.1051 3.6540 4.9918 3.4729 3.3478 14.3174 4.1133 3.1495 3.2224 9.9759 2.9487 6.6088 1.0592 1.0723 1.1090 1.1793 1.2506 1.3328 1.9077 1.7802 1.9318 1.3310 4.2308 4.1098 3.6681 1.1523 2.9880 2.9883 2.4270 2.1488 2.2096 2.0823 2.5937 1.8925 1.2919 1.5920 1.5077 1.2908 1.3714 1.2964 1.2795 1.2911 1.0225 1.1885 1.0519 1.1170 1.1175 1.2893 1.3319 1.3675 1.4503 1.6207 1.6056 1.6160 1.2173 1.0805 1.0724 1.0745 1.0654 1.0715 1.0848 1.0832 1.0425 1.0858 1.0912 1.0938 11.4478 1.0585 1.0585 1.0590 1.0591 1.0591 1.0589 1.0586 1.0591 1.0372 1.0962 1.0975 1.0993 1.0999 1.0627 1.1017 1.1040 1.1046 1.1045 1.1007 1.0993 1.1028 1.0888
irintensity: 0.3086 0.1235 0.1682 0.1251 0.5839 0.0153 0.4078 0.7423 0.0263 0.9631 0.6349 0.0269 0.6026 0.0646 0.9901 0.3752 0.0012 1.1139 4.7794 5.7709 3.8055 11.5370 22.5819 6.7127 11.5629 17.7059 68.0528 20.4488 17.5129 0.7099 9.5526 8.1946 18.5804 25.3445 6.1840 74.0591 53.0797 1.1281 4.6378 2.5044 2.7595 1.4513 4.9918 0.1322 0.8210 2.0919 0.7953 2.0708 16.4946 10.6103 2.0345 2.8637 1.6273 21.4792 1.5495 2.7399 0.9629 3.1061 0.4400 0.3682 0.2772 0.3950 0.6620 1.8631 0.8833 3.9005 2.9314 1.1628 0.1377 0.1553 11.3319 5.2540 0.0648 1.0587 0.2222 0.4907 1.1308 1.9558 12.4023 3.1210 4.0417 35.0267 228.6869 0.0261 0.3142 0.3768 0.7673 4.4645 30.0412 130.3091 100.4713 48.2697 0.3932 0.4763 0.2897 0.0217 13.5731 1.4147 2.5497 25.0683 201.3378 96.0285 54.7705 27.7231 4.1623
temp: 298.150 k
press: 1.00000 atm
elementType: 17 17 8 6 6 6 6 6 6 6 6 6 6 6 6 1 1 1 1 1 1 1 1 1 1 1 1 1 1 1 1 1 1 1 1 1 1
symmnumber: 1
zpe: 830019.6 jmol-1
zpe.correction: 0.316138 hartree
zpe.thermalcorrener: 0.334965 hartree
zpe.thermalcorrenthalpy: 0.335909 hartree
zpe.thermalcorrgfe: 0.265148 hartree
zpe.sumelectzpe: -1464.597595 hartree
zpe.sumelectthermal: -1464.578768 hartree
zpe.sumelectthermalent: -1464.577824 hartree
zpe.sumelectthermalfe: -1464.648585 hartree
dipole: -3.2926 -1.3038 -1.5825
dipole: 3.8789
quadrupole: -130.2692 -111.8885 -108.9781
quadrupole: -4.0098 -5.5171 -0.9055
quadrupole: -13.2239 5.1568 8.0671 -4.0098 -5.5171 -0.9055
hfenergy: -1464.913733 hartree
pointgroup: C01 [X(C12H22Cl2O1)]
dipole: -1.3058253 0.5296795 0.5858009 debye
polarizability: 202.5555472|0.8029917|140.8608893|10.4736085|-5.4722086|122.6535139 unknown
InChI: InChI=1S/C12H22Cl2O/c1-2-3-4-5-6-7-8-9-10-11(13)12(14)15/h11H,2-10H2,1H3
charge 0 multiplicity 1
37 atoms
Cl 5.976874 1.655789 0.248562
Cl 6.099647 -1.941524 0.659354
O  4.578214 -1.092867 -1.444906
C  -1.899747 0.625865 -0.11376
C  -0.570379 -0.028965 0.32413
C  -3.141976 -0.226823 0.229173
C  0.668547 0.831059 -0.01074
C  -4.470988 0.419866 -0.221872
C  1.998179 0.160023 0.404379
C  -5.714251 -0.430691 0.122914
C  3.219143 1.055961 0.072715
C  -7.043153 0.215012 -0.331511
C  4.540432 0.423493 0.510797
C  -8.279819 -0.642172 0.014803
C  4.93228 -0.802774 -0.309353
H  -1.873655 0.810818 -1.208055
H  -1.995218 1.621897 0.367483
H  -0.472558 -1.020228 -0.165597
H  -0.599723 -0.222867 1.416806
H  -3.174163 -0.404328 1.324693
H  -3.042433 -1.226219 -0.24411
H  0.688904 1.037044 -1.100693
H  0.579412 1.815932 0.493212
H  -4.43975 0.594483 -1.317929
H  -4.570295 1.42072 0.248759
H  2.089148 -0.813744 -0.116199
H  1.975096 -0.056517 1.492433
H  -5.748883 -0.604164 1.2191
H  -5.616005 -1.432301 -0.346246
H  3.119823 2.027181 0.59232
H  3.253967 1.261501 -1.012668
H  -7.007342 0.389356 -1.426459
H  -7.14121 1.215051 0.13862
H  4.581351 0.193906 1.585317
H  -8.354185 -0.807553 1.106379
H  -8.222099 -1.634981 -0.470451
H  -9.216185 -0.15754 -0.318001
