program: Gaussian 09
title: 000100986
version: EM64L-G09RevD.01
frameworkgroup: C1[X(C18H36O2)]
method: RPBEPBE
basis: SDD
operation: Freq
keyword: #pfreq=noraman
keyword: PBEPBE/SDD
title: #p freq=noraman PBEPBE/SDD
converged: YES YES NO NO
title: Mulliken charges:
elementType: O O C C C C C C C C C C C C C C C C C C H H H H H H H H H H H H H H H H H H H H H H H H H H H H H H H H H H H H
charge: -0.260079 -0.236288 0.322641 -0.455703 0.007400 0.301160 -0.423729 -0.021985 -0.403427 -0.721549 -0.743215 -0.730851 -0.548982 -0.733547 -0.721884 -0.717155 -0.731275 -0.334742 -0.752255 0.224918 0.201058 0.191295 0.193740 0.197849 0.198433 0.223381 0.226949 0.204139 0.207200 0.227140 0.205308 0.209688 0.209322 0.215043 0.210066 0.209586 0.213757 0.230330 0.251085 0.215240 0.209780 0.214318 0.209970 0.209201 0.209940 0.213815 0.208121 0.209126 0.229467 0.203142 0.208613 0.220275 0.234378 0.215311 0.228933 0.215546
chargesum: 0.00000
title: Mulliken charges with hydrogens summed into heavy atoms:
elementType: O O C C C C C C C C C C C C C C C C C C
charge: -0.260079 -0.236288 0.322641 -0.063350 0.201140 0.301160 -0.027447 0.201397 0.027661 -0.081901 -0.109162 -0.097442 -0.067567 -0.094209 -0.092772 -0.086092 -0.090054 0.119911 -0.092465 0.224918
polarizability: 2.39162982e+02 -8.61999083e-01 1.91530320e+02 4.19521975e-01 -2.71530367e+00 1.78402915e+02
1716.lowfreq: -19.3361 -13.0133 -8.3935 -0.0012 -0.0006 0.0008 3.8313 5.7038 18.1998
frequency: -13.9815 3.7133 17.7143 30.1891 32.2759 51.8960 53.9511 71.1360 77.1859 104.0416 123.4419 164.8591 184.1269 187.1845 193.6367 209.8319 227.3019 234.8304 237.5204 242.0158 255.2218 262.5658 272.4560 281.8927 288.6083 292.8281 301.4780 335.9672 342.3189 346.8159 355.7944 370.8122 396.9590 400.3328 404.1069 407.9115 450.4110 456.5480 465.6590 497.3840 541.1114 616.2476 695.3483 730.4289 736.3506 768.6348 791.2887 824.6689 841.5873 868.8197 873.4494 888.0115 898.7114 905.5217 918.5482 923.1504 924.7418 926.2988 934.5986 938.1188 948.8191 961.7444 968.7261 971.7314 1008.0473 1011.5984 1014.4883 1020.7344 1058.8330 1063.8261 1079.7903 1096.4462 1107.0877 1124.5603 1152.8045 1154.4414 1185.9173 1191.2965 1207.8954 1209.5334 1226.7116 1238.1137 1246.3217 1250.0951 1264.9247 1268.4332 1289.9050 1293.1683 1294.1264 1307.3548 1320.7211 1325.9112 1340.8971 1345.7202 1353.0311 1371.6402 1372.1330 1372.6532 1372.7423 1376.3473 1391.2660 1392.2955 1400.8701 1402.0157 1446.4663 1448.9010 1454.2792 1457.8180 1458.8475 1459.7796 1463.9980 1465.0012 1466.5972 1469.4339 1473.5423 1474.8554 1476.3965 1478.3003 1479.1063 1484.4597 1486.8803 1487.3388 1494.2069 1498.0986 1498.3396 1637.7921 2941.2871 2951.2544 2952.1696 2962.2066 2962.5287 2963.9457 2966.8790 2970.4454 2971.6745 2974.7006 2979.4973 2982.7426 2998.9688 3000.4550 3007.5450 3019.0145 3025.6646 3038.4368 3055.3746 3055.4175 3058.5190 3058.6175 3060.1946 3060.7480 3064.9266 3066.0206 3066.1078 3066.9028 3067.2969 3069.9493 3070.2958 3072.5112 3081.6461 3086.1655 3094.3285 3100.6646
redmass: 2.8190 3.8391 3.3031 4.7475 3.5499 3.1122 3.7715 2.8729 2.4652 2.6832 2.2041 3.2032 2.6513 1.0980 1.1893 2.1892 2.0613 1.3576 1.3068 1.2889 1.2647 1.4993 1.2441 1.4994 2.0829 2.1820 1.6318 2.1528 2.8150 2.1359 2.2001 2.4450 1.9354 2.0344 1.9341 2.4442 2.4966 2.5338 2.3202 2.8388 2.8098 4.0546 4.2252 3.3328 3.6127 2.2095 1.7071 2.2114 2.2869 1.7176 1.7881 1.9211 2.1685 1.6649 1.6333 1.6443 1.6291 1.5973 1.2358 1.2073 2.3963 2.5795 1.8844 1.4869 1.4531 1.4200 1.4248 1.4378 2.3812 2.5911 1.9661 1.5640 2.7792 1.9054 2.0232 1.9908 1.6615 1.9621 2.3178 2.3188 1.4510 1.7401 2.3023 2.5276 1.5941 1.5667 1.2357 1.4279 1.3550 1.4304 1.2956 1.3977 1.4583 1.4457 1.3355 1.2081 1.3031 1.2223 1.2178 1.2141 1.2222 1.2077 1.2064 1.2138 1.0909 1.0832 1.0851 1.0653 1.0565 1.0523 1.0537 1.0533 1.0492 1.0502 1.0836 1.0537 1.0530 1.0509 1.0572 1.0606 1.0600 1.0592 1.0566 1.0537 1.0580 9.3812 1.0595 1.0592 1.0811 1.0349 1.0348 1.0351 1.0358 1.0361 1.0366 1.0374 1.0482 1.0479 1.0856 1.1011 1.0946 1.0627 1.0568 1.1023 1.0999 1.0999 1.0998 1.0997 1.0995 1.0997 1.0991 1.0987 1.0989 1.0985 1.0984 1.0984 1.0984 1.0996 1.0990 1.1031 1.0959 1.1087
irintensity: 0.0046 0.0581 0.2164 0.8343 0.1126 0.1994 0.4266 0.1456 0.3729 0.1715 0.0626 1.0062 0.2708 0.1108 0.0516 0.6583 0.7217 0.2250 0.7607 0.5825 0.0666 0.6902 0.3303 3.4416 2.3939 1.1538 1.9982 0.4414 4.6130 0.7528 0.3025 0.6440 0.3113 2.4577 0.1162 0.5742 1.9961 4.6228 1.9799 1.0229 1.2546 8.9987 1.5731 2.6047 1.9344 11.8123 0.5009 5.8788 0.5836 1.2140 3.2757 1.0208 1.0405 3.3113 3.0919 1.6703 4.0686 1.9246 1.0867 0.0722 87.9216 17.8240 11.0042 9.1253 0.4571 0.5273 1.4458 0.3056 21.2716 69.9772 2.9953 0.4219 7.9801 23.7818 67.8914 14.1706 4.3162 50.0155 18.3729 77.7835 1.7104 67.5245 17.0001 24.9685 2.9636 26.4217 6.7464 6.4119 0.8643 1.7302 5.2968 0.7588 6.3078 7.8518 2.0496 17.3908 3.1269 22.7046 18.9085 24.7874 20.4472 12.4506 12.8379 15.3278 11.6456 1.4261 5.0772 0.3823 1.4129 0.4600 2.3383 2.0315 0.6931 5.3208 7.8506 9.5574 3.7026 6.1435 5.7677 12.3816 11.4216 12.4780 17.1080 28.2286 26.3568 174.0798 26.6743 30.0437 11.7515 38.9090 44.9516 43.4145 37.3986 28.4468 11.6920 23.4129 41.1591 11.7693 11.2391 31.5164 14.1597 22.3984 42.5580 18.7535 5.7469 3.0420 11.0600 4.5662 36.3177 11.7733 34.4178 40.0125 42.7930 113.7984 111.8540 103.1960 60.3596 45.2650 54.6200 18.2488 33.4323 20.1755
temp: 298.150 k
press: 1.00000 atm
elementType: 8 8 6 6 6 6 6 6 6 6 6 6 6 6 6 6 6 6 6 6 1 1 1 1 1 1 1 1 1 1 1 1 1 1 1 1 1 1 1 1 1 1 1 1 1 1 1 1 1 1 1 1 1 1 1 1
symmnumber: 1
zpe: 1321992.1 jmol-1
zpe.correction: 0.503520 hartree
zpe.thermalcorrener: 0.529167 hartree
zpe.thermalcorrenthalpy: 0.530112 hartree
zpe.thermalcorrgfe: 0.445098 hartree
zpe.sumelectzpe: -856.300798 hartree
zpe.sumelectthermal: -856.275151 hartree
zpe.sumelectthermalent: -856.274207 hartree
zpe.sumelectthermalfe: -856.359220 hartree
dipole: -0.0216 2.0634 -0.7525
dipole: 2.1964
quadrupole: -120.2336 -138.0898 -128.4903
quadrupole: -0.1442 -1.7075 3.2405
quadrupole: 8.7043 -9.1519 0.4476 -0.1442 -1.7075 3.2405
hfenergy: -856.8043183 hartree
pointgroup: C01 [X(C18H36O2)]
dipole: -0.0088864 -0.8329585 -0.229856 debye
polarizability: 239.0987462|-1.9846254|191.9463146|0.132189|1.6208904|178.0511554 unknown
InChI: InChI=1S/C18H36O2/c1-14(12-17(3,4)5)9-10-20-16(19)11-15(2)13-18(6,7)8/h14-15H,9-13H2,1-8H3
charge 0 multiplicity 1
56 atoms
O  0.720061 0.938443 -1.04686
O  0.726225 2.892013 0.232937
C  -5.320444 -0.937816 0.186949
C  -3.793079 -0.627822 0.366561
C  -3.105284 0.452268 -0.520126
C  4.935973 -1.290599 -0.14001
C  4.475932 -0.191773 0.875387
C  2.975707 0.232825 0.832467
C  -1.572785 0.411114 -0.240211
C  -6.220688 0.078382 0.943692
C  -5.715098 -0.978253 -1.312778
C  -5.575918 -2.343445 0.804757
C  2.792802 1.541836 -0.001817
C  -3.659508 1.88473 -0.318618
C  6.472109 -1.464963 0.010313
C  4.246747 -2.643605 0.186018
C  4.616095 -0.891257 -1.605175
C  -0.738709 1.123102 -1.315003
C  2.405388 0.420448 2.258946
C  1.335189 1.898553 -0.22825
H  -3.613769 -0.373894 1.433671
H  -3.249164 -1.579068 0.183342
H  -3.259182 0.16578 -1.583028
H  4.708081 -0.569806 1.892294
H  5.112092 0.707663 0.733852
H  2.3875 -0.558327 0.328683
H  -1.365006 0.873944 0.744712
H  -1.236157 -0.642962 -0.186767
H  -5.959478 0.107551 2.018796
H  -6.128053 1.102513 0.546122
H  -7.284245 -0.218092 0.863224
H  -5.075359 -1.685311 -1.875153
H  -6.764969 -1.308935 -1.426792
H  -5.625699 0.015108 -1.789544
H  -6.652104 -2.598629 0.775103
H  -5.02336 -3.127599 0.25299
H  -5.248399 -2.376443 1.861637
H  3.267639 2.38874 0.524364
H  3.280374 1.420363 -0.985021
H  -3.045237 2.634637 -0.849386
H  -4.691379 1.983539 -0.696599
H  -3.661581 2.155216 0.754282
H  7.004963 -0.52706 -0.237058
H  6.741363 -1.74645 1.046359
H  6.84707 -2.257263 -0.664965
H  3.146714 -2.57655 0.095932
H  4.485779 -2.971159 1.215845
H  4.589987 -3.432562 -0.50974
H  3.528516 -0.786473 -1.774417
H  5.102949 0.06605 -1.873809
H  4.989395 -1.664258 -2.303627
H  -0.884989 0.667423 -2.308962
H  -0.949818 2.205718 -1.353249
H  2.976911 1.188921 2.814017
H  1.347247 0.740945 2.241022
H  2.465756 -0.52485 2.828891
