program: Gaussian 09
title: 000100931
version: EM64L-G09RevD.01
frameworkgroup: C1[X(C10H10N2OS)]
method: RPBEPBE
basis: SDD
operation: Freq
keyword: #p
keyword: freq=noraman
keyword: PBEPBE/SDD
title: #p freq=noraman PBEPBE/SDD
converged: YES YES NO NO
title: Mulliken charges:
elementType: S O N N C C C C C C C C C C H H H H H H H H H H
charge: 0.180979 -0.224582 -0.008144 0.010939 -0.759332 -0.751770 0.403321 0.250445 -0.387475 -0.252960 -0.366666 -0.168505 -0.296491 -0.245280 0.276095 0.269146 0.253327 0.291503 0.261502 0.254236 0.257473 0.260612 0.245028 0.246599
chargesum: 0.00000
title: Mulliken charges with hydrogens summed into heavy atoms:
elementType: S O N N C C C C C C C C C C
charge: 0.180979 -0.224582 -0.008144 0.010939 -0.214091 -0.206941 0.403321 0.250445 -0.125973 0.001276 -0.109193 0.092107 -0.051463 0.001319
polarizability: 2.32223077e+02 7.10812991e+00 1.20666489e+02 2.76852317e+00 2.25569238e+00 8.96944668e+01
1716.lowfreq: -15.8969 -5.1750 -0.0016 -0.0006 0.0026 3.7757 14.1339 19.6996 37.5961
frequency: 12.2877 19.3587 37.5610 48.2425 60.4560 106.7479 146.2587 202.9729 296.7535 314.2670 328.0508 397.0890 473.8203 570.9071 591.0322 597.1354 629.2238 667.8557 675.6428 718.9865 733.1450 769.3352 822.0262 827.3568 841.7985 853.4666 872.2270 879.7727 890.4201 913.2827 933.4397 958.7574 974.8592 1008.7697 1032.6299 1048.8484 1093.1307 1105.1575 1135.6551 1166.0378 1212.4741 1228.9731 1238.2991 1243.1026 1249.5892 1274.3432 1306.3882 1367.0405 1387.3941 1435.4055 1438.6047 1446.4580 1481.9349 1501.2352 1532.9013 1585.1691 3017.7039 3028.8916 3102.0800 3108.1628 3137.0041 3142.2558 3163.3513 3220.0357 3235.0487 3269.0293
redmass: 6.7547 4.8918 4.8584 5.1742 4.6817 5.8527 6.9093 4.4611 5.4828 2.4698 2.6073 4.0338 6.6421 6.6981 3.6820 5.0863 6.9177 5.3043 5.3097 4.1308 1.3347 2.3985 1.4077 3.6788 1.8537 1.7702 5.9836 1.3820 1.7577 2.2647 1.4513 1.4860 5.1279 1.5925 2.8351 2.4826 1.3289 1.3518 1.5661 1.7316 1.2241 1.6225 1.6430 4.8646 2.6072 1.5504 1.4182 2.5187 1.8322 1.2176 1.3234 1.4494 4.9067 7.5326 4.7748 6.7294 1.0582 1.0570 1.1076 1.1073 1.0882 1.0924 1.0996 1.0924 1.0989 1.1083
irintensity: 0.4452 0.3203 0.4113 0.3251 1.7501 1.4683 0.7127 1.7487 3.3240 3.6132 2.6098 16.7411 2.6889 1.1900 11.7674 4.6804 4.7481 7.3082 24.1656 0.6049 95.0866 14.1412 23.9005 1.5820 10.3142 17.7411 2.0200 0.4760 4.1114 10.4818 0.5106 0.0389 12.2017 31.7229 3.5071 5.8766 2.5185 5.7087 10.5727 4.4335 15.6303 8.8828 6.1010 2.6897 3.4548 18.0969 3.6451 0.4428 33.9155 1.6192 21.6808 38.0839 12.2145 14.1977 10.4897 1.6482 28.7811 13.5470 9.8926 0.6289 2.1799 23.0203 37.7755 5.0884 0.2999 0.3019
temp: 298.150 k
press: 1.00000 atm
elementType: 16 8 7 7 6 6 6 6 6 6 6 6 6 6 1 1 1 1 1 1 1 1 1 1
symmnumber: 1
zpe: 473168.8 jmol-1
zpe.correction: 0.180220 hartree
zpe.thermalcorrener: 0.193241 hartree
zpe.thermalcorrenthalpy: 0.194185 hartree
zpe.thermalcorrgfe: 0.135714 hartree
zpe.sumelectzpe: -968.789522 hartree
zpe.sumelectthermal: -968.776502 hartree
zpe.sumelectthermalent: -968.775558 hartree
zpe.sumelectthermalfe: -968.834029 hartree
dipole: 1.1977 0.4650 1.5407
dipole: 2.0061
quadrupole: -74.6335 -91.4993 -86.6663
quadrupole: 8.4474 -1.0942 3.3247
quadrupole: 9.6329 -7.2329 -2.3999 8.4474 -1.0942 3.3247
hfenergy: -968.9697425 hartree
pointgroup: C01 [X(C10H10N2O1S1)]
dipole: -0.467434 0.1284479 -0.6228384 debye
dipolederiv: -0.4587932 0.0214716 0.0186453 -0.0225856 -0.1452447 0.018673 -0.1512191 0.0452214 -0.0329366 -0.2851109 0.1699934 0.0953882 0.1517514 -0.5815423 0.0222561 0.0372646 -0.0105206 -0.1755781 -0.3212201 -0.0124077 0.0128196 0.097735 -0.2197097 -0.0106592 -0.026072 -0.0205953 -0.2339067 -0.1509948 -0.0213487 0.0414414 -0.0935784 -0.2098647 -0.0183061 0.0750309 -0.0101993 -0.2329005 0.6921916 -0.0455701 0.1026426 -0.0015739 0.109713 -0.0254504 0.2680828 -0.0098367 0.1639769 -0.106938 -0.0133164 -0.1376554 -0.0381226 0.1308095 0.0045187 -0.2665907 0.0177372 0.12248 -0.0189147 -0.0415452 -0.0819992 0.0948944 0.3488419 -0.0831791 -0.0948443 -0.0658733 -0.0495478 0.7299302 -0.0561102 0.1274243 0.3254827 -0.0728882 0.1078082 0.3932307 -0.0405117 0.0763703 -0.0024623 0.0648138 -0.0799222 -0.0033117 -0.0555961 -0.045332 -0.143081 -0.04791 -0.1347279 -0.1047205 -0.0367792 -0.1026455 -0.1574512 -0.1135806 -0.0086061 -0.0248289 0.0089051 -0.1460603 -0.1605042 0.0093004 -0.025153 -0.3586455 0.1911513 -0.169553 -0.0733793 -0.0079696 -0.0133963 -0.099694 -0.1461789 -0.1104569 -0.0917426 0.2591438 0.0272719 -0.0022232 0.011551 -0.0773332 -0.0531933 -0.0217482 0.000555 -0.4323345 0.2381819 -0.167092 -0.0207615 -0.0377956 0.0204487 0.1848723 -0.0433318 0.1330499 0.357873 -0.0802992 0.1226342 0.0560365 -0.014341 0.0336055 -0.0427281 0.012324 -0.012976 0.0105903 -0.0334086 -0.0931165 -0.0696874 -0.0573899 0.0207041 -0.0493252 -0.0017773 -0.0035787 -0.0174256 0.0173615 0.1042198 -0.063538 0.0721958 -0.0472567 -0.0133573 0.0102599 -0.0012598 -0.0043097 0.0274107 0.0992205 0.0423663 0.0455623 -0.0862592 -0.0032393 0.0107481 0.0233523 -0.0149827 -0.0454405 -0.0833441 0.0616691 -0.0515974 0.0377259 0.1440863 -0.0481086 0.0509306 -0.0514551 0.0052242 0.0541525 0.0407576 0.0531255 0.1521652 0.0220511 0.0670894 0.0835939 0.0771576 0.0928858 -0.0224563 0.098162 -0.0191619 0.1558609 0.0580975 0.0631889 -0.0546639 0.1137027 0.0068656 0.0574361 -0.0519138 0.0435734 0.087655 0.0960912 -0.0177522 0.0738109 -0.0300324 0.050308 0.0498654 0.0836534 0.0365207 0.1711424 0.0192639 0.0657869 -0.0542215 0.1153369 -0.0207565 0.0678224 -0.073395 0.0493504 0.0974722 -0.0753882 0.010998 -0.0991221 -0.0269725 0.1004339 -0.008784 -0.0947198 0.0099595 0.0902963 unknown
polarizability: 231.8676544|-9.1736894|120.1978962|3.6374414|-5.5271565|90.5184817 unknown
InChI: InChI=1S/C10H10N2OS/c1-2-10(13-5-1)8-14-7-9-6-11-3-4-12-9/h1-6H,7-8H2
charge 0 multiplicity 1
24 atoms
S  -0.306946 0.08701 0.161171
O  -3.67744 -1.016982 0.198228
N  3.064064 -1.353924 0.046548
N  4.205241 1.25468 0.307492
C  -1.78729 -0.056271 -1.064812
C  1.065769 -0.442665 -1.05933
C  -3.078866 0.136743 -0.363965
C  2.410819 -0.239735 -0.414786
C  -3.878132 1.239715 -0.091965
C  -5.021071 0.771502 0.66283
C  2.989763 1.053517 -0.277089
C  -4.864408 -0.595378 0.819213
C  4.280351 -1.152403 0.635549
C  4.846859 0.136597 0.767109
H  -1.73125 -1.060299 -1.516705
H  -1.645324 0.714397 -1.839286
H  0.954609 0.18086 -1.963622
H  0.928762 -1.507618 -1.302252
H  -3.669435 2.265043 -0.391315
H  -5.847588 1.371854 1.037295
H  2.466117 1.944605 -0.638774
H  -5.447849 -1.37659 1.297974
H  4.800231 -2.043579 1.002357
H  5.822216 0.288023 1.240435
