program: Gaussian 09
title: 000100928
version: EM64L-G09RevD.01
frameworkgroup: C1[X(C9H11NO4)]
method: RPBEPBE
basis: SDD
operation: Freq
keyword: #p
keyword: freq=noraman
keyword: PBEPBE/SDD
title: #p freq=noraman PBEPBE/SDD
converged: YES YES NO NO
title: Mulliken charges:
elementType: O O O O N C C C C C C C C C H H H H H H H H H H H
charge: -0.405067 -0.519666 -0.446823 -0.383103 -0.400137 -0.055998 -0.364833 0.261289 0.194395 0.294982 -0.316855 -0.379014 -0.439505 -0.159209 0.227355 0.238175 0.382401 0.223311 0.230992 0.259395 0.220855 0.232500 0.384405 0.380907 0.339247
chargesum: 0.00000
title: Mulliken charges with hydrogens summed into heavy atoms:
elementType: O O O O N C C C C C C C C C
charge: -0.020661 -0.138760 -0.107576 -0.383103 -0.017736 -0.055998 0.100698 0.261289 0.194395 0.294982 0.137449 -0.119619 -0.218651 0.073291
polarizability: 1.67800885e+02 -3.30169032e+00 1.32510730e+02 1.44355131e+01 2.16993536e+00 6.37544730e+01
1716.lowfreq: -8.2003 -0.0009 -0.0006 -0.0005 6.7933 9.0563 28.9054 49.3284 79.0002
frequency: 28.4368 49.3107 78.9934 119.8189 133.8516 192.9156 225.4944 240.4741 283.2183 322.6531 354.2131 364.3856 368.3192 406.8301 432.9413 474.8865 506.5336 523.9911 553.1669 574.8441 597.0482 667.1109 735.7147 740.1252 749.5417 777.1662 798.0812 850.3179 856.9234 880.4997 962.1731 977.1595 993.6731 1003.6756 1032.0721 1069.8099 1087.2054 1145.1897 1162.1190 1176.6182 1184.3110 1235.3370 1259.5522 1276.0899 1325.3291 1327.5590 1332.2505 1351.1098 1371.3603 1405.1198 1434.6229 1438.8368 1468.5619 1481.0617 1543.0191 1577.9271 1598.8178 1652.5841 2603.8680 2996.4356 3016.1697 3083.3873 3092.4102 3125.5526 3153.6025 3185.5737 3440.3925 3555.3983 3603.0935
redmass: 5.4669 6.0602 5.5214 3.1031 6.9186 3.6641 4.3998 3.9485 4.8104 1.3883 3.8074 1.1965 3.1418 3.6062 8.3359 3.8272 3.6384 5.0506 3.9904 5.7407 4.4052 3.5282 3.7229 2.5011 1.1335 2.9248 3.6049 1.4717 2.9534 2.4985 1.3123 3.8001 1.0647 2.8476 3.7296 1.9151 2.1701 2.9684 1.1347 1.3241 1.3729 1.9627 1.5060 2.0809 2.1352 3.0978 1.3255 1.3488 1.2356 3.1901 1.2801 2.0280 1.0860 2.7005 2.0093 5.1351 3.2204 3.8696 1.0733 1.0646 1.0590 1.1017 1.1041 1.0888 1.0928 1.0967 1.0805 1.0659 1.0662
irintensity: 3.0847 1.3464 4.1632 1.2912 0.5687 6.1992 0.3952 17.9296 6.1505 109.8454 32.7832 144.1750 27.4170 46.3815 5.4360 3.4344 3.4406 12.2494 1.9572 6.4219 2.0337 23.4801 28.5495 39.1739 29.2737 83.0872 5.9252 7.4626 26.8086 16.6157 2.2604 43.2770 146.4939 152.0072 13.8477 12.7549 3.3670 2.4895 17.0920 14.5895 56.4554 126.2066 2.0645 35.6470 92.6580 102.9218 4.5550 4.7012 25.6877 3.3585 18.9781 132.1768 10.2772 103.0494 414.5017 178.8891 78.5252 183.1803 593.9301 31.8246 30.1517 17.6471 38.2090 9.4875 12.8571 6.1974 126.7883 3.1724 49.0093
temp: 298.150 k
press: 1.00000 atm
elementType: 8 8 8 8 7 6 6 6 6 6 6 6 6 6 1 1 1 1 1 1 1 1 1 1 1
symmnumber: 1
zpe: 506121.1 jmol-1
zpe.correction: 0.192771 hartree
zpe.thermalcorrener: 0.205933 hartree
zpe.thermalcorrenthalpy: 0.206877 hartree
zpe.thermalcorrgfe: 0.152328 hartree
zpe.sumelectzpe: -704.174072 hartree
zpe.sumelectthermal: -704.160910 hartree
zpe.sumelectthermalent: -704.159966 hartree
zpe.sumelectthermalfe: -704.214515 hartree
dipole: 1.5967 -4.9620 -1.0700
dipole: 5.3213
quadrupole: -83.2934 -78.0653 -84.4830
quadrupole: -11.4924 7.1977 1.9170
quadrupole: -1.3462 3.8819 -2.5357 -11.4924 7.1977 1.9170
hfenergy: -704.3668429 hartree
pointgroup: C01 [X(C9H11N1O4)]
dipole: -1.0180996 1.4744972 1.082756 debye
dipolederiv: -0.7718597 0.2014294 0.2814816 0.1008219 -0.7341775 -0.351129 0.2061188 -0.3696064 -0.7911512 -0.4730626 -0.3643959 -0.300671 -0.2543178 -0.8710392 -0.315963 -0.2092863 -0.3041441 -0.6117932 -0.2455251 0.1476915 -0.0228873 0.1862884 -0.5227662 0.0584826 -0.1828405 0.0569701 -0.8076153 -0.8592313 0.0612068 0.1864197 -0.1395477 -0.690481 -0.2800293 0.0071345 -0.3046242 -0.6987701 -1.1035933 -0.2391282 -0.1530031 -0.4286286 -0.6801367 -0.0873113 -0.3308861 -0.1264369 -0.5285415 -0.8918255 -0.1588256 0.0744308 0.0238343 -0.2995385 -0.201919 0.269509 -0.1438001 -0.2848224 0.5798959 0.128774 -0.0329016 0.161719 0.189825 0.0493985 -0.1153485 -0.070448 0.099689 1.6980325 0.2710096 -0.1274392 0.5704414 0.825688 0.4364434 0.0887687 0.4586133 0.6708136 0.5441671 -0.3467431 -0.4389553 -0.0349491 0.5301407 0.3881278 -0.1671876 0.4721119 0.602052 0.7555441 0.4626599 0.2123519 0.0219871 0.6329459 0.4473956 -0.1763814 0.3337436 0.4362627 0.2365965 -0.0535946 -0.0232653 -0.1061565 0.2686104 -0.0513938 0.122974 0.0588495 0.6433588 -0.2574471 0.3474571 0.3206698 0.0607588 -0.1501431 0.0426749 0.0676931 -0.0459485 -0.2795231 -0.5656293 -0.341824 -0.2196278 -0.1218768 -0.3182478 -0.018252 -0.0136768 0.051955 -0.2057862 0.1615911 0.0556444 -0.0331643 0.1404636 0.2499994 0.268249 0.0452389 0.2914166 0.1534917 -0.0246459 -0.0224013 -0.0109867 -0.0659049 -0.1214668 -0.0096261 -0.0128265 -0.0613942 0.1109737 0.0117698 -0.0153321 -0.0382022 0.0303788 0.1052987 -0.0322373 0.0665928 0.0270539 -0.0925158 0.3178102 -0.068651 -0.0492417 -0.0862345 0.2721923 -0.0249642 -0.0291326 -0.0219025 0.3032747 -0.1835654 -0.034633 0.0669883 -0.0260757 0.1047057 0.0217975 0.0073406 -0.0053324 0.0179601 0.0989063 -0.0693552 -0.0282169 -0.0238217 -0.1288783 -0.0454054 -0.0014766 -0.0438702 -0.03434 0.0531839 -0.0522419 -0.0084747 -0.075967 0.055632 -0.0869659 -0.0285857 -0.0938626 0.1039689 0.0598938 0.0063583 0.0449565 0.0342313 0.0320121 -0.1506982 0.0712897 -0.1443686 0.0408041 -0.0993565 -0.0340903 0.0461224 -0.0265699 0.1200755 -0.0199378 0.0543697 -0.0174357 0.1198191 0.7509462 0.1232639 0.0097061 0.179945 0.444111 0.0428538 0.038833 0.044909 0.3897756 0.1426391 0.0865895 0.1424882 0.0262748 0.3813614 -0.0170538 0.0988275 -0.0294789 0.3330911 0.0647652 -0.0908679 0.1014216 -0.1470944 0.3042771 -0.062537 0.1229382 -0.0129695 0.3095237 unknown
polarizability: 165.5871172|17.1374168|101.3861956|-11.1801761|33.6616631|97.0927745 unknown
InChI: InChI=1S/C9H11NO4/c11-5-4-10-9(14)8-6(12)2-1-3-7(8)13/h1-3,10-13H,4-5H2
charge 0 multiplicity 1
25 atoms
O  -0.923852 -2.088273 -1.776973
O  -0.604216 1.597883 1.413195
O  3.82661 0.250726 1.895643
O  1.256393 -0.939165 -1.43121
N  1.533028 0.831324 0.030897
C  -0.696145 -0.228028 -0.190715
C  2.954695 0.984074 -0.327205
C  0.743581 -0.123877 -0.552732
C  -1.482499 -1.245351 -0.852166
C  -1.368787 0.600075 0.756306
C  3.864974 0.007528 0.446451
C  -2.863658 -1.397907 -0.559336
C  -2.736431 0.451962 1.048913
C  -3.47582 -0.555449 0.379895
H  3.250542 2.022073 -0.09465
H  3.073187 0.805413 -1.411351
H  1.08176 1.469425 0.698082
H  4.91522 0.175405 0.15624
H  3.586422 -1.036347 0.20191
H  -3.417799 -2.179903 -1.084129
H  -3.223607 1.10456 1.783482
H  -4.541148 -0.675367 0.603057
H  0.087436 -1.819492 -1.853837
H  -1.165311 2.126425 2.0305
H  2.921724 0.017787 2.226033
