program: Gaussian 09
title: 000100941
version: EM64L-G09RevD.01
frameworkgroup: C1[X(C17H26O2)]
method: RPBEPBE
basis: SDD
operation: Freq
keyword: #pfreq=noraman
keyword: PBEPBE/SDD
title: #p freq=noraman PBEPBE/SDD
converged: YES YES NO NO
title: Mulliken charges:
elementType: O O C C C C C C C C C C C C C C C C C H H H H H H H H H H H H H H H H H H H H H H H H H H
charge: -0.225680 -0.235502 0.244790 0.349512 -0.392722 0.347730 -0.259038 -0.611427 -0.483786 0.239236 -0.254864 -0.490419 -0.496465 -0.763282 -0.780950 -0.773822 -0.765663 -0.363667 0.014547 0.254335 0.247019 0.227169 0.211266 0.206429 0.218404 0.234188 0.205404 0.204270 0.225785 0.200283 0.216324 0.225576 0.202184 0.205510 0.216461 0.225871 0.212893 0.215981 0.224257 0.208823 0.211773 0.223354 0.237913 0.235471 0.204530
chargesum: 0.00000
title: Mulliken charges with hydrogens summed into heavy atoms:
elementType: O O C C C C C C C C C C C C C C C C C
charge: -0.225680 -0.235502 0.244790 0.349512 -0.138388 0.347730 -0.012019 -0.172992 -0.058954 0.239236 -0.020676 -0.080745 -0.070397 -0.119198 -0.133108 -0.120691 -0.121713 0.109718 0.219077
polarizability: 1.89992681e+02 -5.88397627e+00 1.75692290e+02 -3.28608390e+00 -1.07322941e+00 1.57872930e+02
1716.lowfreq: -12.0246 -5.3122 -0.0002 0.0003 0.0005 8.3032 14.4479 35.3049 65.5431
frequency: 7.2192 34.3403 65.4887 100.4193 105.8232 141.0335 165.4084 189.0827 195.1083 203.9683 209.9349 216.5701 233.0903 260.5265 266.6371 296.8213 308.3425 330.0755 335.0750 362.7139 392.8992 403.0651 421.0038 443.7019 461.7301 468.5890 479.8518 506.2871 538.9976 573.3781 594.9277 666.8926 707.8405 719.6552 734.8054 779.8841 841.4049 849.2791 859.9448 886.0826 902.5175 910.0853 913.9517 926.4569 930.2596 932.0927 936.3414 939.7678 947.1663 958.3457 966.7024 974.0023 999.6533 1001.6433 1018.8415 1026.4480 1034.6785 1061.4977 1074.3508 1098.7680 1102.6181 1113.3171 1115.3012 1126.9939 1151.6850 1159.4331 1175.8937 1192.2498 1195.7318 1213.7335 1217.3985 1219.5943 1231.8553 1244.1205 1265.2917 1269.1517 1281.2511 1291.8980 1312.6905 1327.5248 1335.1695 1339.9780 1362.6293 1364.9050 1372.8876 1376.6141 1377.7489 1393.5213 1396.1862 1454.6183 1456.8685 1459.5217 1464.1930 1465.4672 1469.2256 1473.1063 1476.5832 1478.3437 1481.9511 1486.3796 1494.3133 1506.6573 1619.6216 2964.4863 2968.3310 2971.2199 2973.5122 2977.7425 2978.7563 2990.1313 2997.7615 3005.7473 3006.3290 3023.1128 3032.4863 3040.9327 3053.2073 3059.4120 3064.4976 3064.7999 3066.8810 3069.0706 3070.2400 3073.8151 3074.8470 3077.8883 3080.6849 3100.2067 3147.7686
redmass: 8.7084 4.4489 3.4716 3.5622 3.1483 1.1086 2.6100 2.1211 1.6612 1.9161 1.6840 1.7488 2.1829 1.6376 1.7087 2.6186 2.6496 2.1855 2.4584 2.4268 2.3266 2.5024 2.6323 2.7162 2.1898 2.4988 2.7776 3.1975 2.5997 3.0116 3.0409 2.6210 3.6865 5.5622 4.6715 2.3749 3.3667 3.2924 2.7585 2.9846 1.9921 2.6475 1.9679 1.5759 2.0181 1.5090 1.6374 1.6521 1.7120 1.6115 1.7400 1.6227 1.3691 1.4543 1.4375 1.9013 1.5496 1.8677 2.2024 3.3956 2.4584 2.0897 1.4478 1.7031 2.0760 1.9537 2.1599 2.3347 2.0316 1.4242 1.8736 2.0461 1.8412 1.8104 1.5519 1.8243 1.6110 1.7328 2.8609 1.4781 1.2903 1.2631 1.3181 1.6981 1.2184 1.2593 2.8922 1.2585 1.2401 1.0753 1.0677 1.0534 1.0565 1.0767 1.0737 1.0722 1.0713 1.0599 1.0601 1.0726 1.0700 1.0786 8.4747 1.0593 1.0361 1.0365 1.0387 1.0693 1.0389 1.0741 1.0645 1.0589 1.0615 1.0985 1.0912 1.0998 1.0983 1.0993 1.0983 1.0989 1.0990 1.1004 1.0993 1.0981 1.1055 1.0928 1.0966 1.0962 1.0929
irintensity: 1.5779 0.4944 0.2351 0.4890 0.4527 0.0030 0.2566 1.0515 0.0809 1.9025 2.5720 1.0694 0.0779 0.0611 0.0683 0.3848 5.1446 8.0205 10.6629 0.9648 1.5169 5.3179 1.1350 3.3036 0.8117 1.1303 0.3419 4.7719 1.4269 0.0821 2.6550 1.2815 0.2142 0.6932 2.7629 4.7777 2.5431 11.4093 1.2185 2.0413 3.2523 2.3890 1.2844 2.2732 2.4751 0.9859 1.9374 8.0201 4.0565 4.8854 6.5966 5.1583 0.5914 1.1040 3.4360 4.3435 1.7278 0.6926 20.7764 226.7027 115.2869 5.9506 4.3570 2.0512 0.9319 7.0238 1.3486 1.7968 5.3813 4.5806 12.5476 0.9634 0.5300 1.0467 9.2372 2.1545 4.0552 13.3427 1.0686 4.6400 7.1760 4.9955 4.0758 0.9578 13.4089 19.6569 6.2546 22.6405 9.7805 1.5863 0.3838 3.0278 6.0134 7.8395 8.5463 14.9023 9.5656 36.1383 2.0871 14.7928 9.7093 6.2859 309.6830 17.1505 45.3100 26.4584 22.7959 24.4029 40.8078 47.6911 38.3193 55.0402 30.6664 43.5552 52.0717 43.7869 13.0137 8.8551 33.0021 24.3581 63.1546 46.1467 43.9587 38.8366 37.8828 71.9397 33.0228 32.9601 17.4866
temp: 298.150 k
press: 1.00000 atm
elementType: 8 8 6 6 6 6 6 6 6 6 6 6 6 6 6 6 6 6 6 1 1 1 1 1 1 1 1 1 1 1 1 1 1 1 1 1 1 1 1 1 1 1 1 1 1
symmnumber: 1
zpe: 1029742.9 jmol-1
zpe.correction: 0.392208 hartree
zpe.thermalcorrener: 0.411303 hartree
zpe.thermalcorrenthalpy: 0.412247 hartree
zpe.thermalcorrgfe: 0.344849 hartree
zpe.sumelectzpe: -812.341711 hartree
zpe.sumelectthermal: -812.322616 hartree
zpe.sumelectthermalent: -812.321672 hartree
zpe.sumelectthermalfe: -812.389070 hartree
dipole: 2.0096 0.9788 -1.2524
dipole: 2.5623
quadrupole: -124.5144 -117.5504 -116.5314
quadrupole: -8.5248 4.4389 4.6049
quadrupole: -4.9823 1.9817 3.0007 -8.5248 4.4389 4.6049
hfenergy: -812.7339194 hartree
pointgroup: C01 [X(C17H26O2)]
dipole: 0.7787322 0.3700226 -0.52236 debye
polarizability: 190.0589845|-5.8794263|175.3846476|-3.4038195|-1.921302|158.1142692 unknown
InChI: InChI=1S/C17H26O2/c1-14(2)6-5-11(9-19-10-18)17-13-7-12(15(17,3)4)8-16(13,14)17/h10-13H,5-9H2,1-4H3
charge 0 multiplicity 1
45 atoms
O  -2.957233 -0.23649 -0.251645
O  -4.272545 -1.659119 1.067793
C  0.029222 0.351066 -0.254683
C  1.427696 0.063091 0.386192
C  0.1755 0.23785 1.285083
C  -0.000266 1.873683 -0.591914
C  0.914971 2.327081 0.614583
C  2.16886 1.414359 0.46924
C  0.226911 1.6651 1.851276
C  2.152243 -1.278359 0.20341
C  -0.688954 -0.708994 -1.101944
C  1.132135 -2.35507 -0.289664
C  0.276194 -1.874946 -1.484201
C  -1.407573 2.515328 -0.549489
C  0.61919 2.179264 -1.97915
C  3.294524 -1.127912 -0.841328
C  2.773979 -1.746099 1.547047
C  -1.938604 -1.315626 -0.441283
C  -4.058974 -0.558355 0.520052
H  -0.255658 -0.595599 1.8462
H  1.102383 3.410496 0.677447
H  2.776291 1.64423 -0.421727
H  2.826219 1.480395 1.35775
H  0.858427 1.739305 2.75674
H  -0.766384 2.081895 2.087465
H  -1.028632 -0.227532 -2.041353
H  0.471288 -2.647833 0.551866
H  1.693221 -3.266978 -0.574113
H  0.943642 -1.533509 -2.297369
H  -0.306403 -2.724059 -1.894815
H  -2.03818 2.127854 -1.369758
H  -1.94521 2.302534 0.38794
H  -1.32885 3.613519 -0.668707
H  -0.057442 1.841651 -2.787408
H  0.76579 3.268417 -2.110116
H  1.59182 1.681385 -2.133206
H  3.783075 -2.10419 -1.021048
H  2.923752 -0.7460 -1.810189
H  4.067613 -0.425968 -0.479983
H  3.283806 -2.72135 1.425514
H  3.520718 -1.018661 1.91649
H  1.996909 -1.85938 2.325076
H  -1.727869 -1.768163 0.543474
H  -2.394333 -2.087555 -1.089147
H  -4.721969 0.326544 0.5708
