program: Gaussian 09
title: 000100942
version: EM64L-G09RevD.01
frameworkgroup: C1[X(C17H26O)]
method: RPBEPBE
basis: SDD
operation: Freq
keyword: #pfreq=noraman
keyword: PBEPBE/SDD
title: #p freq=noraman PBEPBE/SDD
converged: NO YES NO NO
title: Mulliken charges:
elementType: O C C C C C C C C C C C C C C C C C H H H H H H H H H H H H H H H H H H H H H H H H H H
charge: -0.257508 0.262224 -0.218252 0.281737 -0.661066 0.254133 0.289475 -0.569121 -0.466734 -0.517617 0.061136 -0.539330 -0.801792 -0.780503 -0.795263 -0.789172 0.085605 -0.792922 0.244697 0.226113 0.253561 0.230337 0.242730 0.214968 0.222761 0.209087 0.215427 0.231261 0.220819 0.206523 0.278795 0.207944 0.283244 0.211098 0.207907 0.239803 0.211504 0.220966 0.215073 0.217104 0.218465 0.236043 0.234463 0.254275
chargesum: 0.00000
title: Mulliken charges with hydrogens summed into heavy atoms:
elementType: O C C C C C C C C C C C C C C C C C
charge: -0.257508 0.262224 0.026445 0.281737 -0.181392 0.254133 0.289475 -0.096054 -0.029005 -0.093103 0.061136 -0.087249 -0.108530 -0.078254 -0.122990 -0.138531 0.085605 -0.068140
polarizability: 1.97446474e+02 7.77941616e+00 1.92582573e+02 -8.67648330e-01 3.92096578e+00 1.45077342e+02
1716.lowfreq: -6.1179 -0.0008 -0.0004 -0.0003 12.1392 16.6627 40.5770 82.9340 91.8181
frequency: 40.2322 82.9098 91.7336 157.9384 180.6296 186.6698 195.7930 207.0889 214.3407 217.7575 240.3589 247.7252 264.1028 270.5235 281.9281 311.2565 314.4572 331.1695 339.3604 349.7386 376.5755 402.3668 424.8858 449.6158 455.2030 480.6492 516.9150 528.5853 547.4376 585.3577 592.6009 629.0241 672.4049 740.3934 767.0624 801.7134 818.2780 829.3156 837.2628 888.6587 908.3323 910.4784 930.5379 940.6935 943.7444 949.3189 959.8728 972.4805 986.4621 994.5106 999.9222 1002.1011 1011.4821 1022.4949 1037.5733 1060.2458 1072.5345 1081.8377 1112.9463 1126.1460 1140.9206 1149.1832 1165.9581 1177.4179 1204.3130 1210.3744 1221.3438 1230.3518 1237.3828 1245.5282 1247.1300 1249.3048 1279.3327 1283.9570 1310.5032 1317.9225 1335.4837 1350.6388 1364.5559 1367.1849 1377.8195 1386.1614 1395.0949 1439.8146 1454.3727 1456.5485 1463.1184 1465.7986 1467.3816 1470.5749 1475.2109 1476.3986 1481.1902 1485.3260 1489.6921 1495.2973 1497.2668 1517.0888 1550.6254 1610.1970 2950.4330 2971.5894 2972.7977 2976.9946 2977.2558 2980.2918 2980.9956 3003.5725 3013.3290 3016.7975 3018.0009 3031.7184 3056.0185 3059.8515 3062.7950 3065.0065 3065.1125 3066.4481 3070.6107 3073.8177 3078.2218 3084.6481 3091.1410 3112.3438 3116.4825 3120.1943
redmass: 3.4509 3.1252 3.6005 2.5282 2.3638 1.0867 1.7030 2.1483 1.3985 1.4194 1.6491 3.0334 1.2904 1.5356 2.3447 2.5270 2.1784 2.5555 2.6507 2.6749 2.3532 2.7116 2.5804 2.5615 2.9182 2.5020 3.6291 2.9913 3.0731 2.6861 3.3722 3.2713 3.9280 3.4258 2.8015 3.0903 1.4165 3.2927 2.0487 2.3723 2.0043 2.6069 2.1266 1.4800 1.5964 1.8151 1.8431 1.8663 1.6846 2.0088 1.3719 1.5669 1.6821 1.9071 2.1249 1.6021 2.2751 2.1917 1.3597 2.1363 1.9329 2.7281 1.7148 2.0162 2.2203 1.9365 2.4349 1.5261 1.6011 2.0352 2.4361 1.7821 1.6641 1.7077 1.4949 2.1529 1.5653 1.4969 1.1849 1.2468 1.2069 1.2122 1.2103 1.1013 1.0508 1.0792 1.0650 1.0631 1.0698 1.0684 1.0707 1.0686 1.0848 1.0532 1.0924 1.0627 1.0637 1.0769 5.3542 8.4746 1.0673 1.0355 1.0513 1.0421 1.0414 1.0378 1.0382 1.0611 1.0627 1.0642 1.0905 1.1007 1.0904 1.0998 1.0993 1.0974 1.0979 1.0983 1.0971 1.0990 1.0987 1.1016 1.1016 1.0971 1.0973 1.0994
irintensity: 2.7798 0.5972 2.0915 0.0420 1.9435 0.4039 1.0980 0.5430 0.0074 0.1132 0.1851 2.1054 0.5265 0.4202 0.7730 0.2507 0.4683 0.3814 0.9186 0.6345 0.6918 0.5556 0.2571 0.3303 2.1741 0.3758 7.5511 5.4014 2.2293 2.4385 0.1145 14.4308 0.6640 1.0579 0.6485 2.7352 6.3610 0.6571 3.3001 2.9779 1.6379 24.4512 13.8968 0.7821 0.5091 9.6023 2.6226 4.6228 4.3858 7.6122 2.6988 4.9017 2.3845 1.9531 0.7877 2.6054 4.5778 13.0255 3.8616 4.0353 9.5407 2.7497 1.3954 29.7513 13.4224 7.4874 32.7942 2.6998 2.4617 21.1611 99.9437 5.6027 18.4819 2.8826 4.0409 2.4940 0.1375 10.1888 27.0068 40.8140 18.9518 37.8899 21.5434 35.4796 1.8920 15.8230 8.9070 3.3616 4.9147 10.5330 1.4361 9.6874 12.6419 7.3283 5.2681 11.9866 14.3857 12.4017 153.8443 78.9811 26.5312 26.0899 23.2170 59.5465 27.3092 11.7802 34.0862 36.7131 30.1521 54.7009 31.9386 38.6999 42.8190 2.4057 10.3580 23.3498 24.6513 51.0691 51.8732 38.0237 43.3579 44.9697 31.9914 3.3721 6.5626 17.5585
temp: 298.150 k
press: 1.00000 atm
elementType: 8 6 6 6 6 6 6 6 6 6 6 6 6 6 6 6 6 6 1 1 1 1 1 1 1 1 1 1 1 1 1 1 1 1 1 1 1 1 1 1 1 1 1 1
symmnumber: 1
zpe: 1019541.1 jmol-1
zpe.correction: 0.388323 hartree
zpe.thermalcorrener: 0.406380 hartree
zpe.thermalcorrenthalpy: 0.407324 hartree
zpe.thermalcorrgfe: 0.345216 hartree
zpe.sumelectzpe: -737.217705 hartree
zpe.sumelectthermal: -737.199648 hartree
zpe.sumelectthermalent: -737.198703 hartree
zpe.sumelectthermalfe: -737.260811 hartree
dipole: 2.7874 -1.5164 -0.9605
dipole: 3.3154
quadrupole: -119.4730 -105.1336 -111.0281
quadrupole: 4.9423 3.1582 0.7021
quadrupole: -7.5948 6.7447 0.8501 4.9423 3.1582 0.7021
hfenergy: -737.6060276 hartree
pointgroup: C01 [X(C17H26O1)]
dipole: -1.0819316 -0.5989606 0.4147966 debye
polarizability: 196.818633|-7.8549052|193.1141074|-4.6500859|-0.7804481|145.1736489 unknown
InChI: InChI=1S/C17H26O/c1-11(18)13-7-8-15(2,3)17-9-6-12(10-17)16(4,5)14(13)17/h12H,6-10H2,1-5H3
charge 0 multiplicity 1
44 atoms
O  3.245182 0.029878 -0.756086
C  -1.235933 0.237132 -0.019966
C  -0.688491 2.461151 -0.151856
C  0.705563 1.753232 -0.366756
C  -1.667938 1.487234 -0.852325
C  0.299438 0.257936 -0.204211
C  -1.901059 -1.132764 -0.345299
C  -1.461994 0.793036 1.450557
C  -1.155192 2.326356 1.324449
C  -1.10417 -2.207253 0.444441
C  1.059231 -0.896029 -0.153345
C  0.381998 -2.263203 0.037922
C  1.774609 2.250091 0.64168
C  1.209252 2.064565 -1.811335
C  -1.823292 -1.423173 -1.871005
C  -3.391386 -1.18759 0.078568
C  2.547605 -0.944427 -0.329132
C  3.275929 -2.250407 0.00991
H  -0.677997 3.497876 -0.528147
H  -2.727851 1.75313 -0.685182
H  -1.495615 1.378599 -1.93454
H  -0.805852 0.290851 2.182226
H  -2.506911 0.621537 1.762405
H  -2.070234 2.92563 1.48619
H  -0.402363 2.675018 2.050143
H  -1.564907 -3.203536 0.291018
H  -1.184816 -1.984498 1.526798
H  0.482333 -2.837801 -0.907452
H  0.93144 -2.849756 0.798319
H  1.580185 1.891826 1.66821
H  2.776329 1.906038 0.343544
H  1.775582 3.357331 0.659128
H  2.149076 1.525339 -2.003516
H  0.473034 1.783932 -2.584837
H  1.399458 3.151524 -1.899972
H  -0.805725 -1.266279 -2.270626
H  -2.117837 -2.470111 -2.075709
H  -2.511728 -0.766504 -2.433617
H  -3.513082 -1.178969 1.176755
H  -3.964842 -0.338873 -0.338559
H  -3.853289 -2.120273 -0.296891
H  2.892242 -3.102579 -0.580782
H  3.150412 -2.512342 1.07776
H  4.346707 -2.113374 -0.205379
