program: Gaussian 09
title: 000100910
version: EM64L-G09RevD.01
frameworkgroup: C1[X(C12H16O)]
method: RPBEPBE
basis: SDD
operation: Freq
keyword: #pfreq=noraman
keyword: PBEPBE/SDD
title: #p freq=noraman PBEPBE/SDD
converged: YES YES NO NO
title: Mulliken charges:
elementType: O C C C C C C C C C C C C H H H H H H H H H H H H H H H H
charge: -0.210966 -0.381082 -0.551075 -0.502088 0.507733 0.225099 -0.480916 -0.434344 -0.395180 -0.672631 -0.224082 -0.232932 -0.243881 0.222476 0.245821 0.200800 0.201828 0.230140 0.229861 0.228490 0.230861 0.229745 0.231139 0.210460 0.222952 0.238984 0.222720 0.223261 0.226809
chargesum: 0.00000
title: Mulliken charges with hydrogens summed into heavy atoms:
elementType: O C C C C C C C C C C C C
charge: -0.210966 0.087215 -0.148448 -0.042088 0.507733 0.225099 -0.021565 -0.204598 -0.164041 -0.000235 -0.001362 -0.009671 -0.017072
polarizability: 1.66782420e+02 9.98504438e+00 1.21196658e+02 -1.53603876e+01 7.27368968e+00 9.39435877e+01
1716.lowfreq: -0.0006 -0.0002 0.0002 5.7564 8.0937 11.7641 17.3346 27.4487 49.0096
frequency: 17.1361 26.1892 48.9706 58.5916 80.9561 105.0884 141.7313 183.4151 216.5541 250.6676 305.9777 341.0214 403.0482 408.0879 456.7065 500.0866 581.7736 617.9841 637.0243 704.7426 712.8051 754.5367 759.9288 796.3917 832.0546 841.6353 853.4928 914.8705 974.5967 980.6447 989.7265 993.2810 995.5589 1011.0768 1026.8926 1044.3767 1056.6764 1082.6389 1098.2846 1117.8401 1144.7224 1171.4507 1187.2684 1216.9823 1234.6468 1247.7328 1260.5826 1286.0617 1314.5909 1328.3243 1337.1359 1353.2531 1382.9523 1397.1221 1431.5564 1434.7390 1440.5207 1467.9987 1470.0477 1479.8425 1483.3775 1484.5273 1593.6841 1614.8694 1634.5319 2946.8753 2960.1459 2967.6253 2997.3385 3000.7522 3004.9393 3010.2601 3020.2858 3068.5062 3091.9056 3102.2781 3113.8134 3114.0226 3130.8375 3142.3310 3161.5005
redmass: 4.8230 3.5905 3.9475 2.2688 2.3135 1.7981 3.1848 1.2676 5.0242 3.2790 3.5689 2.7183 2.8173 3.3472 2.0993 3.4565 4.0891 6.3556 3.6581 1.7269 1.2327 1.6164 1.5101 2.9498 2.7963 1.5411 1.2586 1.4542 1.3920 2.4396 5.4967 1.3322 1.7221 1.8215 2.2119 2.1814 1.7579 2.6626 1.6057 2.0290 1.4596 1.0517 1.1181 2.3673 1.2873 1.3367 1.2495 1.1131 1.4552 1.3093 1.6572 1.7293 7.7234 1.2087 1.0752 1.1033 2.1702 1.1020 1.0404 1.0498 1.1003 2.2778 6.0529 6.1829 7.9069 1.0627 1.0628 1.0599 1.0372 1.0688 1.0869 1.0939 1.1003 1.1028 1.1004 1.0997 1.0866 1.0873 1.0907 1.0958 1.1015
irintensity: 3.5784 0.1253 0.9263 0.9111 0.2199 0.3595 0.8013 0.0775 0.6378 4.3078 8.0783 3.3534 0.0536 0.9784 1.7708 15.4806 6.9278 0.1131 0.8193 51.4828 1.4643 17.3807 39.1666 1.2396 6.1517 3.5196 0.2765 0.9588 0.1643 25.8723 0.0880 0.8395 10.3031 2.5764 6.2244 4.4346 5.2901 1.2006 4.9723 37.6840 13.5562 0.1303 0.2210 0.1833 12.8472 35.0519 1.2511 0.6916 1.3653 5.4643 31.1223 32.8684 0.1215 21.9040 5.0976 31.4200 6.6752 1.3148 12.4257 14.5323 15.7963 18.9343 1.3210 9.5474 79.8704 21.2544 21.1693 33.7435 29.7601 31.0914 3.9814 21.6855 9.2527 33.6450 33.1824 27.3544 10.1322 7.9446 10.8534 47.5430 24.1638
temp: 298.150 k
press: 1.00000 atm
elementType: 8 6 6 6 6 6 6 6 6 6 6 6 6 1 1 1 1 1 1 1 1 1 1 1 1 1 1 1 1
symmnumber: 1
zpe: 646910.6 jmol-1
zpe.correction: 0.246395 hartree
zpe.thermalcorrener: 0.260139 hartree
zpe.thermalcorrenthalpy: 0.261083 hartree
zpe.thermalcorrgfe: 0.202831 hartree
zpe.sumelectzpe: -541.119975 hartree
zpe.sumelectthermal: -541.106231 hartree
zpe.sumelectthermalent: -541.105287 hartree
zpe.sumelectthermalfe: -541.163539 hartree
dipole: -0.6893 -2.6372 1.2596
dipole: 3.0028
quadrupole: -72.8575 -78.0647 -79.0680
quadrupole: 9.4600 -6.2188 4.9251
quadrupole: 3.8059 -1.4013 -2.4046 9.4600 -6.2188 4.9251
hfenergy: -541.3663702 hartree
pointgroup: C01 [X(C12H16O1)]
dipole: 0.2797311 -0.991186 -0.5787795 debye
polarizability: 166.5810564|-8.0700385|121.8702015|-17.087261|-5.2346477|93.4714074 unknown
InChI: InChI=1S/C12H16O/c1-2-12(13)10-6-9-11-7-4-3-5-8-11/h3-5,7-8H,2,6,9-10H2,1H3
charge 0 multiplicity 1
29 atoms
O  3.055462 1.298665 0.62131
C  0.656211 -0.114753 -0.12319
C  -0.498747 -0.727151 -0.961078
C  2.043065 -0.526046 -0.654219
C  -1.872272 -0.34181 -0.429133
C  3.213854 0.207542 0.012511
C  4.588139 -0.458306 -0.114875
C  -2.640595 -1.249785 0.343362
C  -2.400127 0.954593 -0.666823
C  5.762961 0.444395 0.298594
C  -3.899869 -0.875453 0.866818
C  -3.657623 1.333755 -0.147583
C  -4.413188 0.418958 0.62326
H  0.552682 -0.427481 0.933512
H  0.581216 0.987824 -0.122455
H  -0.390104 -0.385829 -2.010885
H  -0.395724 -1.830342 -0.972186
H  2.108288 -0.304964 -1.743261
H  2.200738 -1.6204 -0.567586
H  4.705481 -0.827398 -1.154507
H  4.561966 -1.373933 0.515107
H  -2.250199 -2.257574 0.533977
H  -1.821719 1.669722 -1.265758
H  6.719274 -0.105395 0.242951
H  5.83053 1.329851 -0.357359
H  5.625449 0.813931 1.328704
H  -4.479565 -1.592265 1.45986
H  -4.049522 2.338278 -0.344545
H  -5.389661 0.710773 1.025975
