program: Gaussian 09
title: 000100892
version: EM64L-G09RevD.01
frameworkgroup: C1[X(C7H12N2O2)]
method: RPBEPBE
basis: SDD
operation: Freq
keyword: #p
keyword: freq=noraman
keyword: PBEPBE/SDD
title: #p freq=noraman PBEPBE/SDD
converged: YES YES NO NO
title: Mulliken charges:
elementType: O O N N C C C C C C C H H H H H H H H H H H H
charge: -0.213006 -0.236525 -0.402004 -0.401112 -0.401555 -0.149586 -0.037305 0.155026 -0.705546 -0.718478 0.186859 0.219851 0.239832 0.259013 0.212033 0.345335 0.204359 0.227300 0.219202 0.199617 0.225633 0.220015 0.351044
chargesum: 0.00000
title: Mulliken charges with hydrogens summed into heavy atoms:
elementType: O O N N C C C C C C C
charge: -0.213006 -0.236525 -0.056668 -0.050068 0.058127 0.109427 0.174728 0.155026 -0.054686 -0.073214 0.186859
polarizability: 1.13380459e+02 -7.54919019e+00 1.00514006e+02 2.02416847e+00 3.92667617e-01 6.41617308e+01
1716.lowfreq: -25.4772 -9.5910 -7.1792 -0.0005 -0.0004 0.0007 30.4264 68.8009 103.9077
frequency: 27.7751 68.7616 103.7316 156.2106 162.1793 197.2128 211.9128 276.7582 324.6641 361.9718 374.5325 420.5559 475.3978 500.0728 573.8133 603.7694 615.6977 661.6643 693.2556 722.4084 795.8592 848.4585 889.7697 918.2070 952.5824 960.9956 964.3250 1009.3293 1052.7518 1121.4238 1129.8957 1177.6730 1193.9174 1216.1698 1231.2651 1291.0250 1307.2063 1314.5483 1328.5656 1343.2531 1352.6921 1364.9068 1377.8915 1396.8824 1453.1468 1466.7483 1477.4814 1486.2723 1493.7498 1681.9536 1723.3530 2959.5455 2968.4864 2974.0335 2982.9707 2989.1831 3046.2812 3050.8210 3064.1171 3071.5802 3078.1725 3593.1449 3620.5869
redmass: 3.3300 3.8863 3.3471 4.1083 5.7318 1.4120 2.3798 1.0508 3.0171 2.6231 4.0310 2.5140 1.3826 2.0463 2.7541 8.9780 2.8137 1.5860 4.9499 6.8174 3.1380 2.3899 2.2665 1.2967 1.6302 3.2820 1.9611 2.1987 1.8454 1.8550 1.8580 2.5923 1.9251 1.7948 1.3013 1.7815 1.6457 1.5257 2.4376 1.5920 1.4306 1.6878 1.2385 1.2196 1.0816 1.0465 1.0534 1.0494 1.0556 8.4168 9.5612 1.0404 1.0723 1.0387 1.0780 1.0701 1.1023 1.0979 1.0979 1.0992 1.0997 1.0803 1.0800
irintensity: 0.3177 0.1212 0.2012 4.3383 0.7972 0.5296 1.4111 0.7423 3.3181 4.9680 11.2919 5.1068 62.7438 21.6956 17.7037 13.8121 47.6299 90.3242 12.3298 67.3732 1.0716 7.2064 6.6394 0.0956 3.2098 14.5344 0.5150 3.8582 28.2553 6.5911 9.9854 58.7646 7.0180 108.7212 7.1774 51.4944 14.9762 10.2138 101.4204 49.2020 0.7186 20.1927 17.3786 17.1398 7.0683 2.1430 4.4087 24.9494 15.3738 563.7776 385.7721 24.6076 11.5894 23.7963 7.4835 30.6181 11.1668 41.2741 71.4879 41.0611 42.2020 72.8750 47.3652
temp: 298.150 k
press: 1.00000 atm
elementType: 8 8 7 7 6 6 6 6 6 6 6 1 1 1 1 1 1 1 1 1 1 1 1
symmnumber: 1
zpe: 497966.9 jmol-1
zpe.correction: 0.189666 hartree
zpe.thermalcorrener: 0.201054 hartree
zpe.thermalcorrenthalpy: 0.201999 hartree
zpe.thermalcorrgfe: 0.151740 hartree
zpe.sumelectzpe: -533.077692 hartree
zpe.sumelectthermal: -533.066303 hartree
zpe.sumelectthermalent: -533.065359 hartree
zpe.sumelectthermalfe: -533.115617 hartree
dipole: -3.6278 -0.8153 -0.0677
dipole: 3.7189
quadrupole: -68.1977 -79.3135 -65.1069
quadrupole: 8.5251 0.0577 0.2803
quadrupole: 2.6750 -8.4408 5.7658 8.5251 0.0577 0.2803
hfenergy: -533.2673572 hartree
pointgroup: C01 [X(C7H12N2O2)]
dipole: 1.4313116 -0.303453 0.0066981 debye
dipolederiv: -0.527297 -0.0092115 -0.007125 -0.0382898 -1.1800038 -0.0742971 -0.0082533 -0.0376982 -0.3476974 -1.02845 -0.3648584 -0.0631903 -0.5302292 -0.9247686 -0.06519 -0.1165028 -0.0763252 -0.3777763 -1.2024017 -0.0371859 -0.0150479 -0.0484619 -0.4340278 0.0235636 -0.0003008 0.0182972 -0.4849451 -0.7522011 -0.4717228 -0.0281957 -0.2082441 -1.3172399 -0.0738159 -0.0594971 -0.0931746 -0.3605958 0.1254133 -0.0391215 -0.0144729 0.0212132 -0.0364307 -0.007596 -0.1136966 0.0546453 0.0780507 -0.1162337 0.3221307 -0.006119 0.4969239 0.1897976 0.0407395 0.0006219 0.0510861 0.301706 0.191822 0.0055389 0.0112112 -0.0282762 0.1653617 0.00754 0.0623927 0.0005207 0.1192767 1.1419715 0.4555877 0.0850387 0.0967511 1.5070796 0.1112673 0.1552532 0.081808 0.2076321 -0.0119564 -0.0087024 -0.0741182 0.0172689 -0.0017321 -0.0572521 -0.1016884 -0.03991 -0.0044618 0.006354 0.0154911 -0.0306415 0.0301325 -0.0941235 0.0042114 -0.0737772 -0.0099036 0.0793594 1.8110321 0.2245675 0.1469174 0.4130407 1.7607742 0.1125951 0.2067486 0.0998813 0.3134085 -0.0229379 -0.0204096 -0.0758095 -0.0187378 0.070306 -0.0872742 -0.0512419 -0.0464635 -0.102641 0.0327235 -0.0051574 0.0111228 -0.0363496 -0.1025349 0.0292909 0.0275634 -0.009233 0.089832 0.0896644 -0.0388987 -0.0627628 -0.0669631 0.0208991 -0.0002572 -0.0623238 -0.0300364 -0.0714898 -0.0794491 -0.0232125 0.1016615 -0.0160723 0.0174219 0.0391499 0.0954693 0.0399124 -0.1112562 0.2533034 -0.0029803 -0.0366823 -0.0165759 0.151069 -0.0181507 -0.045285 -0.0254946 0.3269454 0.0131787 -0.0357633 0.1428339 -0.0564032 0.0610479 0.0525671 0.1128602 0.0168582 -0.0912622 0.109123 0.0086519 -0.0079807 -0.0372916 -0.1672369 -0.0055984 0.0019205 0.026536 0.0678361 -0.1704599 0.0636279 -0.0607463 0.104476 0.0692793 0.0135837 -0.0281719 -0.0014292 0.0716048 0.024323 -0.0645724 0.118401 -0.035313 0.0386621 0.0200765 0.1458654 0.0639514 -0.1004141 -0.162204 0.1280118 -0.010492 0.0710199 0.0373217 0.0147132 -0.0145287 0.0182048 0.0965683 0.0495983 -0.0918044 -0.1064811 -0.0673311 0.0065089 -0.0687112 -0.1000847 -0.0934076 -0.0637078 0.2250835 -0.0100063 -0.0173212 -0.0462875 0.1625688 -0.0111555 -0.0333429 -0.0086254 0.3640275 unknown
polarizability: 113.1219834|7.3981581|100.3309955|3.3650727|3.7963586|64.6032169 unknown
InChI: InChI=1S/C7H12N2O2/c1-4(2)3-5-6(10)9-7(11)8-5/h4-5,8-9H,3H2,1-2H3
charge 0 multiplicity 1
23 atoms
O  -1.035299 2.494597 0.243683
O  -2.896084 -1.82366 -0.177797
N  -0.661509 -1.056715 0.150417
N  -2.282332 0.48401 0.023563
C  1.154543 0.52155 -0.731583
C  0.043804 0.229229 0.310477
C  2.55119 -0.085952 -0.416306
C  -1.124338 1.24492 0.198529
C  3.206747 0.575361 0.82039
C  2.528246 -1.627807 -0.270718
C  -2.033323 -0.928929 -0.017855
H  0.79933 0.165951 -1.718609
H  1.251052 1.623259 -0.795026
H  0.464162 0.322664 1.332449
H  3.185928 0.153845 -1.294884
H  -0.210146 -1.968157 0.154244
H  2.645398 0.356965 1.749136
H  3.258353 1.673739 0.708253
H  4.235316 0.197507 0.965971
H  2.009943 -1.937798 0.658889
H  3.556512 -2.028019 -0.207095
H  2.031543 -2.112224 -1.132609
H  -3.220334 0.869363 -0.085916
