program: Gaussian 09
title: 000100933
version: EM64L-G09RevD.01
frameworkgroup: C1[X(C18H29ClO)]
method: RPBEPBE
basis: SDD
operation: Freq
keyword: #p
keyword: freq=noraman
keyword: PBEPBE/SDD
title: #p freq=noraman PBEPBE/SDD
converged: YES YES NO NO
title: Mulliken charges:
elementType: Cl O C C C C C C C C C C C C C C C C C C H H H H H H H H H H H H H H H H H H H H H H H H H H H H H
charge: -0.115397 -0.097609 -0.391694 -0.352420 -0.368744 -0.412661 -0.408092 -0.471039 -0.422036 -0.173529 -0.160736 -0.000466 -0.540405 -0.158983 -0.164305 -0.527482 -0.185329 -0.161741 -0.443189 -0.666512 0.208437 0.190747 0.218818 0.184620 0.230611 0.195238 0.196907 0.200108 0.223958 0.207105 0.200655 0.204594 0.272151 0.268659 0.222217 0.213263 0.207670 0.201388 0.229674 0.214035 0.205318 0.221324 0.213618 0.203441 0.201423 0.247059 0.218607 0.210499 0.210226
chargesum: 0.00000
title: Mulliken charges with hydrogens summed into heavy atoms:
elementType: Cl O C C C C C C C C C C C C C C C C C C
charge: -0.115397 -0.097609 0.007490 0.051018 0.057105 -0.015647 0.022971 -0.065789 0.118774 0.048688 0.052526 -0.000466 -0.131347 0.070692 0.049730 -0.100840 0.028289 0.085318 -0.038325 -0.027179
polarizability: 2.14831890e+02 -1.12491906e+00 1.92331927e+02 -7.48017922e+00 -1.70075616e+01 2.10190754e+02
1716.lowfreq: -8.8958 -4.8759 -1.4570 0.0009 0.0017 0.0022 11.7898 18.5977 24.1430
frequency: 10.8421 18.0169 24.0494 30.2946 32.9868 42.8788 50.5739 62.2206 77.3755 86.4896 99.7633 111.1018 121.7027 146.1392 156.1842 165.2664 193.6469 204.9197 217.2715 236.2368 248.8603 258.6751 275.6395 294.3023 314.3864 354.4035 383.6869 388.0663 399.6130 416.3267 440.3923 463.5729 473.9675 482.0030 508.3262 524.6386 666.8104 717.0272 752.0581 762.9344 772.8981 790.0353 803.3485 817.9490 838.9602 864.2189 882.3442 888.2964 909.0647 911.8572 936.4561 948.7945 964.6530 968.2997 976.0320 980.9144 995.7528 1010.3136 1029.3607 1037.7930 1051.5824 1066.5598 1068.5837 1078.4859 1086.8539 1099.1034 1105.7698 1118.0150 1131.7719 1133.2284 1162.3655 1177.7851 1188.7596 1201.0292 1228.6116 1239.3621 1241.9173 1248.4223 1262.3741 1270.6611 1283.0807 1285.5836 1289.2388 1292.9712 1298.9711 1300.6787 1303.1789 1319.6222 1327.0574 1337.4510 1343.8291 1346.4560 1350.4158 1353.1866 1361.4758 1382.5381 1432.0437 1452.7160 1453.4888 1457.5303 1458.7087 1460.7202 1462.9528 1465.3109 1471.5986 1474.1620 1478.9660 1487.6467 1675.9514 1682.6893 1687.2248 1760.8408 2940.3315 2948.2011 2953.3647 2956.7491 2961.0576 2963.8365 2972.3125 2973.4304 2976.8869 2982.8343 2995.3127 3004.0706 3010.4883 3020.9388 3024.5941 3030.2492 3032.7644 3036.0807 3040.6026 3049.7755 3061.3560 3062.6189 3068.9027 3069.3935 3070.1877 3071.9071 3076.5918 3083.8161 3090.9926
redmass: 7.1810 4.6855 4.8738 7.1887 4.3501 3.4161 4.3878 5.8005 2.4362 2.5806 2.4463 2.6296 2.5978 2.0131 2.6594 2.6896 2.5836 1.7332 1.8429 2.0941 2.9679 2.6635 1.7787 2.6560 3.4295 3.0911 11.8303 2.6379 2.6594 2.1343 2.2040 2.6789 3.6530 2.3734 2.1109 3.0594 3.1696 1.1817 1.4034 1.3606 1.5538 1.4617 1.5512 1.8578 2.4853 2.4919 2.0206 2.0114 1.8757 1.9925 1.9962 1.8718 2.1984 1.1811 1.1529 1.1257 2.0043 1.9189 2.5659 1.8519 3.0217 1.9476 2.0484 1.6001 1.8179 2.3362 2.8778 2.2085 1.5273 1.3741 1.8302 1.3200 1.3612 1.2784 1.3874 1.2183 1.2576 1.2441 1.2717 1.2654 1.2520 1.2387 1.2273 1.2452 1.2166 1.1991 1.2404 1.3885 1.3632 1.3929 1.4306 1.4191 1.4141 1.3660 1.5528 1.2036 1.0798 1.0891 1.0944 1.0821 1.0750 1.0745 1.0863 1.0817 1.0948 1.0433 1.0904 1.0674 6.3000 6.4873 6.6340 10.7969 1.0657 1.0640 1.0614 1.0605 1.0613 1.0618 1.0438 1.0559 1.0587 1.0633 1.0676 1.0929 1.0992 1.0979 1.0998 1.0943 1.0981 1.0924 1.1014 1.1026 1.0941 1.0914 1.0930 1.0991 1.0890 1.0926 1.1005 1.0887 1.0895
irintensity: 0.9356 0.3097 0.7424 0.2583 0.1223 0.0935 0.2634 2.0165 0.2104 0.3017 0.8906 0.0738 0.6562 0.2532 2.1963 0.2604 0.5111 0.9532 0.6109 0.6508 4.3997 2.5304 1.7410 2.4557 0.4465 21.0825 9.4099 4.6501 1.5944 1.4109 9.0069 2.5018 1.9864 3.7643 1.5418 0.5194 60.6643 33.9177 17.5323 2.8393 5.4581 7.4628 2.3560 13.1108 13.4934 15.8090 3.6019 33.0766 4.6803 7.6170 9.5836 7.5393 44.9377 4.3100 73.8058 85.1742 7.9608 7.6629 1.6367 6.5408 6.5332 11.3021 16.2509 8.4161 0.9069 2.0897 4.0607 0.5252 2.9752 0.4975 1.4217 1.7196 0.3435 0.8136 4.2801 0.2807 7.1873 0.4681 1.1593 1.1639 1.8580 0.7519 2.4111 3.4847 0.4295 0.3711 1.0296 2.6456 7.9710 0.4791 0.1827 0.4535 2.5436 1.5738 3.7168 5.9087 47.8542 18.8072 7.8885 12.1624 4.9004 3.6327 6.4454 1.9194 16.5320 11.2764 33.9722 2.1476 0.1585 0.4975 0.1410 216.7981 42.1426 45.6451 11.4497 12.1534 57.2702 58.2701 61.8503 29.6872 44.5116 29.5411 13.5326 0.6712 15.1889 13.2338 17.4949 18.8403 36.9425 2.4629 51.0795 91.9828 2.5756 10.8539 16.4387 41.0924 88.4396 4.6346 56.7680 53.8488 43.7076
temp: 298.150 k
press: 1.00000 atm
elementType: 17 8 6 6 6 6 6 6 6 6 6 6 6 6 6 6 6 6 6 6 1 1 1 1 1 1 1 1 1 1 1 1 1 1 1 1 1 1 1 1 1 1 1 1 1 1 1 1 1
symmnumber: 1
zpe: 1111152.4 jmol-1
zpe.correction: 0.423216 hartree
zpe.thermalcorrener: 0.448159 hartree
zpe.thermalcorrenthalpy: 0.449103 hartree
zpe.thermalcorrgfe: 0.363382 hartree
zpe.sumelectzpe: -1236.963171 hartree
zpe.sumelectthermal: -1236.938228 hartree
zpe.sumelectthermalent: -1236.937284 hartree
zpe.sumelectthermalfe: -1237.023005 hartree
dipole: -1.7540 2.3109 -2.3022
dipole: 3.7036
quadrupole: -134.5919 -118.8916 -136.3471
quadrupole: -2.0350 -1.5271 1.2821
quadrupole: -4.6484 11.0519 -6.4036 -2.0350 -1.5271 1.2821
hfenergy: -1237.386387 hartree
pointgroup: C01 [X(C18H29Cl1O1)]
dipole: -0.9029547 -0.8961652 0.7104315 debye
polarizability: 213.9589203|-3.0948405|199.8194453|3.6562427|-20.2734005|203.5762057 unknown
InChI: InChI=1S/C18H29ClO/c1-2-3-4-5-6-7-8-9-10-11-12-13-14-15-16-17-18(19)20/h3-4,6-7,9-10H,2,5,8,11-17H2,1H3
charge 0 multiplicity 1
49 atoms
Cl 0.058815 -0.998559 -3.735622
O  1.521636 -1.81553 -1.560889
C  -2.145761 -1.438911 0.835596
C  -2.221028 -0.381977 1.960793
C  -0.804807 -2.209288 0.846206
C  -3.55346 0.404882 2.011088
C  -0.688674 -3.311853 -0.235046
C  -3.869444 1.228668 0.726524
C  -0.760074 -2.790867 -1.690113
C  -2.776474 2.21864 0.377603
C  -2.07492 2.235297 -0.785725
C  0.428534 -1.948658 -2.090178
C  -0.939428 3.194049 -1.110706
C  0.38218 2.457309 -1.284303
C  1.489332 2.667526 -0.526793
C  2.801548 1.910914 -0.672356
C  3.248539 1.279034 0.638333
C  3.404225 -0.054764 0.844249
C  3.835596 -0.689738 2.151477
C  2.781257 -1.687034 2.699425
H  -2.27689 -0.928067 -0.138323
H  -2.989732 -2.154227 0.938154
H  -1.382978 0.332033 1.832214
H  -2.063591 -0.882959 2.938446
H  0.032238 -1.490689 0.74072
H  -0.673401 -2.685958 1.838573
H  -4.393777 -0.295141 2.198397
H  -3.523543 1.097937 2.876712
H  0.257665 -3.868354 -0.095547
H  -1.512644 -4.041805 -0.107865
H  -4.82486 1.768211 0.894844
H  -4.04224 0.54933 -0.130531
H  -1.676024 -2.204863 -1.878084
H  -0.794541 -3.631777 -2.413521
H  -2.530756 2.961483 1.154759
H  -2.308619 1.486807 -1.561015
H  -1.179912 3.73729 -2.049944
H  -0.845065 3.953787 -0.311651
H  0.410446 1.690837 -2.074988
H  1.455469 3.429171 0.26943
H  3.588617 2.618109 -1.0149
H  2.703869 1.133586 -1.452797
H  3.445717 1.975958 1.469903
H  4.033779 0.097564 2.90458
H  4.791179 -1.234555 2.001306
H  3.188364 -0.747989 0.016264
H  1.829593 -1.169048 2.917684
H  3.135527 -2.171365 3.628355
H  2.570917 -2.480744 1.957857
