program: Gaussian 09
title: 000100890
version: EM64L-G09RevD.01
frameworkgroup: C1[X(C7H13NO)]
method: RPBEPBE
basis: SDD
operation: Freq
keyword: #p
keyword: freq=noraman
keyword: PBEPBE/SDD
title: #p freq=noraman PBEPBE/SDD
converged: YES YES NO NO
title: Mulliken charges:
elementType: O N C C C C C C C H H H H H H H H H H H H H
charge: -0.279685 -0.021257 -0.079183 -0.240372 -0.692408 -0.701212 -0.214347 -0.437679 -0.120323 0.222849 0.196721 0.176660 0.212283 0.193093 0.244017 0.223439 0.213788 0.203294 0.198046 0.202015 0.263162 0.237098
chargesum: 0.00000
title: Mulliken charges with hydrogens summed into heavy atoms:
elementType: O N C C C C C C C
charge: -0.279685 -0.021257 0.143666 0.133009 -0.043015 -0.060691 0.185714 0.062581 -0.120323
polarizability: 9.44651575e+01 -2.58925816e+00 8.26748713e+01 -7.23127920e-01 -6.08411079e-01 7.03485578e+01
1716.lowfreq: -26.6494 -12.0604 -6.0726 -0.0004 -0.0002 0.0004 20.5662 38.5275 88.1141
frequency: 7.9360 38.4290 88.0987 123.5648 139.0676 190.0609 208.3686 224.2210 287.0726 293.1360 367.6949 387.5009 426.2281 455.5095 576.6565 814.8398 825.7915 836.3528 910.4848 918.6459 944.0979 969.0613 981.3498 1026.2256 1056.2410 1083.2583 1136.9681 1148.8052 1188.4330 1191.8854 1229.6755 1240.5257 1294.4799 1326.3514 1338.3437 1347.3186 1374.5117 1387.3195 1402.7999 1433.4190 1462.3115 1467.8057 1471.9372 1480.7530 1486.4283 1489.1782 2206.1977 2905.7795 2929.6264 2961.9638 2968.7199 2973.1076 2980.0218 2999.9221 3010.4675 3058.8650 3067.7242 3068.4402 3076.7986 3093.5854
redmass: 3.0613 5.2538 3.5748 2.4683 3.2509 1.1009 2.7318 1.1126 2.8723 2.9793 3.4139 2.3875 2.2191 3.4584 3.3405 3.0304 2.3339 2.7637 1.3583 1.2058 1.5083 1.7622 3.1522 2.2667 2.5465 3.7775 1.9685 1.7091 1.7220 1.1368 1.2808 1.1855 1.3037 1.4268 1.3431 1.3980 1.2194 1.2879 1.3271 1.0903 1.0663 1.0459 1.0700 1.0483 1.0721 1.0636 12.4380 1.0556 1.0557 1.1019 1.0364 1.0383 1.1038 1.0864 1.0618 1.0988 1.0985 1.1006 1.0987 1.0990
irintensity: 1.7581 4.2042 1.9981 3.8103 6.1378 0.6034 1.0602 0.3800 4.2263 0.1519 0.3516 1.4711 0.6150 1.7048 7.1469 1.6925 2.3664 4.5327 4.7119 2.7129 5.9734 5.3895 15.6256 21.2749 74.5589 90.7480 1.3666 2.4636 8.7298 2.7220 3.7545 3.3766 4.3620 6.3680 10.9373 7.2015 21.4489 20.3737 3.6825 18.7206 7.7089 1.9071 3.9683 12.5003 5.3927 21.3806 9.0319 44.7776 92.2777 49.9763 36.7729 24.7634 42.4673 25.1867 17.7192 20.5015 70.7484 7.4775 50.5521 29.0046
temp: 298.150 k
press: 1.00000 atm
elementType: 8 7 6 6 6 6 6 6 6 1 1 1 1 1 1 1 1 1 1 1 1 1
symmnumber: 1
zpe: 492744.0 jmol-1
zpe.correction: 0.187676 hartree
zpe.thermalcorrener: 0.199041 hartree
zpe.thermalcorrenthalpy: 0.199985 hartree
zpe.thermalcorrgfe: 0.148175 hartree
zpe.sumelectzpe: -403.755032 hartree
zpe.sumelectthermal: -403.743667 hartree
zpe.sumelectthermalent: -403.742723 hartree
zpe.sumelectthermalfe: -403.794533 hartree
dipole: 2.0152 -4.1573 -1.1719
dipole: 4.7663
quadrupole: -61.3918 -58.7900 -54.5078
quadrupole: 13.7618 -0.2163 0.4601
quadrupole: -3.1619 -0.5601 3.7220 13.7618 -0.2163 0.4601
hfenergy: -403.9427079 hartree
pointgroup: C01 [X(C7H13N1O1)]
dipole: -0.8409258 -1.6423797 -0.3343184 debye
dipolederiv: -1.2457591 0.1647428 0.0919614 0.2160368 -0.4491794 -0.0394488 0.1061198 -0.0049374 -0.414085 -0.2809707 -0.0257239 -0.0073066 -0.0701928 -0.2548635 0.0050375 -0.05987 -0.0217456 -0.2358854 0.0537567 0.0048679 0.0163947 0.0011399 0.1069526 0.0012748 0.024439 0.0043207 0.1207793 0.7991867 0.0230603 -0.0830641 0.1170189 0.2976292 0.0676148 -0.214023 0.0844643 0.3730059 0.0092869 0.0232183 0.014631 0.0473747 0.0847604 0.0268525 0.021222 0.016068 -0.1035346 -0.0461343 0.0181873 0.0522537 0.0718933 0.0750934 0.0147263 0.0254761 0.0334863 0.0121524 0.7712599 -0.1208066 0.0454748 -0.3072064 0.483484 0.0358456 0.0888929 -0.0376502 0.3456958 0.0220584 -0.0640087 0.0148853 -0.0672024 0.0971067 -0.0546733 0.0363591 -0.047548 0.1376708 0.0112242 0.0714664 0.0599262 0.1073755 0.0715924 0.0812466 0.1217395 0.0972588 -0.0141072 0.0122469 -0.0902958 -0.0224849 -0.0748974 -0.1019373 -0.0512251 -0.0390199 -0.0425711 0.0144983 -0.0456004 0.0207021 -0.0613388 -0.0192383 0.0456535 0.0224027 0.0327584 0.0335542 -0.2286137 -0.0796572 -0.0581762 0.010042 -0.1234278 -0.1702286 -0.0376299 0.010977 -0.1008083 0.0202628 -0.0289101 0.1368501 -0.0795156 0.1386738 -0.0608122 0.0658057 -0.0540026 0.0335955 0.0505579 0.0410317 -0.0916228 -0.0498816 -0.119859 -0.1199516 -0.0849235 -0.0170134 -0.0170979 0.0457516 -0.0365004 -0.0381035 0.1419095 -0.0349306 0.0996141 -0.0020753 0.1240793 -0.0038718 0.0072917 -0.0718573 0.1136561 -0.0153656 0.1435641 -0.0382782 0.0344093 -0.0439649 0.0589924 0.0843927 0.0750114 -0.0148788 -0.0553282 -0.01719 0.096398 0.0043297 -0.0001572 -0.004682 -0.1983323 0.0364852 -0.0647156 0.0088311 -0.1352722 -0.1232322 -0.0331212 -0.0234534 -0.0760462 0.066401 -0.0265074 0.0291722 0.0075929 0.0735867 0.0268924 0.013448 -0.0739771 0.0925403 -0.1816259 -0.0597894 -0.0791585 -0.0338763 0.0518662 -0.2024611 -0.0830697 -0.0143359 -0.1065623 0.0155445 0.130116 -0.0269108 -0.0494312 -0.0516636 0.0546891 0.0416324 -0.0181941 0.0097937 -0.03754 -0.0399778 0.0684778 -0.0063097 0.0525505 -0.0189218 -0.0284593 -0.0340515 -0.0005535 0.1197193 unknown
polarizability: 94.5832999|2.021385|79.5878794|1.1673001|5.3077317|73.3174074 unknown
InChI: InChI=1S/C7H13NO/c1-7(2)6-9-5-3-4-8/h7H,3,5-6H2,1-2H3
charge 0 multiplicity 1
22 atoms
O  0.032745 -0.327269 -0.185897
N  3.316958 1.355971 0.767287
C  -2.258577 0.464414 0.078525
C  -1.250625 -0.629231 0.467576
C  -2.524173 0.463342 -1.443693
C  -3.566245 0.279683 0.884147
C  1.06264 -1.31904 0.096406
C  2.37708 -0.787845 -0.508827
C  2.891371 0.401676 0.19211
H  -1.802776 1.436001 0.355434
H  -1.106115 -0.654134 1.570972
H  -1.618467 -1.629176 0.138767
H  -3.195648 1.294736 -1.726222
H  -3.007331 -0.483595 -1.75583
H  -1.579753 0.571179 -2.003808
H  -4.294223 1.069912 0.626482
H  -3.385937 0.328177 1.974638
H  -4.038402 -0.696183 0.657623
H  1.172222 -1.479913 1.190959
H  0.811535 -2.293865 -0.377777
H  2.199114 -0.531485 -1.569505
H  3.148107 -1.580854 -0.479266
