program: Gaussian 09
title: 000100919
version: EM64L-G09RevD.01
frameworkgroup: C1[X(C10H18O6)]
method: RPBEPBE
basis: SDD
operation: Freq
keyword: #pfreq=noraman
keyword: PBEPBE/SDD
title: #p freq=noraman PBEPBE/SDD
converged: YES YES NO NO
title: Mulliken charges:
elementType: O O O O O O C C C C C C C C C C H H H H H H H H H H H H H H H H H H
charge: -0.264324 -0.295977 -0.244214 -0.411765 -0.237402 -0.447848 -0.363234 -0.396435 -0.527070 -0.461580 0.265771 -0.270040 -0.244656 0.192015 -0.252734 -0.316495 0.244585 0.204524 0.206334 0.254463 0.237479 0.254911 0.222238 0.237599 0.247134 0.221650 0.191829 0.208302 0.207317 0.192602 0.208477 0.203520 0.377828 0.355196
chargesum: 0.00000
title: Mulliken charges with hydrogens summed into heavy atoms:
elementType: O O O O O O C C C C C C C C C C
charge: -0.264324 -0.295977 -0.244214 -0.033936 -0.237402 -0.092652 0.085874 0.064362 -0.034680 -0.001743 0.265771 0.198743 0.155475 0.192015 0.147185 0.095502
polarizability: 1.55687020e+02 1.03630292e-01 1.23166498e+02 -5.95960494e+00 5.50558474e-01 1.05657792e+02
1716.lowfreq: -4.0843 -0.0009 -0.0008 -0.0004 3.9271 5.7218 7.9042 20.0395 22.9031
frequency: 5.7280 19.5466 22.8633 23.4276 34.7213 42.8063 62.6801 77.8925 113.4269 145.1935 158.7778 170.0652 203.9799 212.3166 234.8738 270.1382 278.1559 326.8951 352.2772 409.2851 473.9284 490.4181 499.7986 510.8459 526.9106 544.4904 611.1851 640.2709 700.0761 756.0466 780.2260 796.7760 816.8136 834.8297 870.1258 885.7004 902.2605 916.8684 983.3174 1002.4142 1011.7928 1023.3371 1038.6424 1058.9433 1068.5911 1070.9439 1097.3910 1103.7979 1115.5559 1132.2243 1173.3760 1183.4633 1189.2919 1202.3338 1207.2927 1233.4544 1251.1020 1281.5742 1291.9430 1318.6043 1328.1352 1331.6865 1335.5515 1343.7747 1364.7301 1373.6623 1384.0931 1403.8728 1436.9324 1453.8523 1454.4362 1455.4310 1459.0083 1463.5541 1473.0573 1473.1140 1642.0680 1664.9556 2934.1651 2942.3539 2966.8553 2984.2286 2989.5842 2991.3958 3000.3403 3004.6233 3020.3789 3024.0260 3041.2545 3051.2795 3071.4590 3080.4930 3087.3743 3096.2417 3513.9572 3522.5874
redmass: 6.0076 6.0598 6.3019 8.6559 6.7672 3.8437 4.3702 6.2312 3.6226 3.2378 3.9934 2.9282 2.8764 2.4149 2.2490 2.5575 4.3755 2.4411 3.3968 2.4512 2.4602 2.8329 1.3689 2.2670 4.0381 3.0829 1.2546 2.7104 2.6379 2.1408 2.1853 3.1181 2.7707 2.4410 2.6051 2.9202 1.9192 2.2293 2.2039 2.5634 2.5058 2.5334 2.6943 2.1352 2.3195 2.4824 2.3070 3.1678 2.1309 2.2256 1.3133 1.3316 1.1516 1.1832 1.1656 1.2925 1.1164 1.3954 1.4935 1.1977 1.1812 1.5767 1.2641 1.4353 1.5097 1.5252 1.2496 1.5403 1.0898 1.0800 1.1050 1.0903 1.0789 1.0866 1.0911 1.0815 9.4767 8.3241 1.0567 1.0556 1.0712 1.0621 1.0623 1.1011 1.0630 1.1036 1.0608 1.0598 1.0973 1.0965 1.1024 1.0964 1.1065 1.1043 1.0639 1.0651
irintensity: 0.1414 0.6346 0.4716 0.9897 3.0709 0.8214 0.9263 0.5648 1.6655 2.4558 12.8775 3.8445 2.0669 4.7696 3.0097 1.4042 11.2493 1.1709 2.7873 3.9401 32.4822 17.1901 97.7123 54.1349 31.8702 3.2303 122.5912 0.1480 46.1272 14.1968 5.4080 7.2982 4.5299 5.6942 10.4864 20.5806 4.7390 61.8044 59.2802 72.8365 8.3899 47.0408 38.7901 79.5874 84.9570 51.7934 102.3464 132.7616 23.7494 218.6115 37.8272 26.7184 9.9946 7.6363 23.2898 5.2070 6.0218 14.7854 22.3944 0.7597 21.5637 37.4211 17.8207 21.7051 10.9225 3.0630 27.6217 3.7047 34.0070 13.6261 16.1382 15.6475 4.7942 3.3935 13.0370 7.1602 166.6519 223.3794 28.1808 99.7410 33.5492 18.3428 34.0699 42.9682 20.4772 81.9434 30.3454 15.5987 4.0988 6.1878 35.7586 39.2873 19.9884 18.1544 21.9711 16.2699
temp: 298.150 k
press: 1.00000 atm
elementType: 8 8 8 8 8 8 6 6 6 6 6 6 6 6 6 6 1 1 1 1 1 1 1 1 1 1 1 1 1 1 1 1 1 1
symmnumber: 1
zpe: 729282.5 jmol-1
zpe.correction: 0.277769 hartree
zpe.thermalcorrener: 0.296647 hartree
zpe.thermalcorrenthalpy: 0.297591 hartree
zpe.thermalcorrgfe: 0.223876 hartree
zpe.sumelectzpe: -841.896269 hartree
zpe.sumelectthermal: -841.877391 hartree
zpe.sumelectthermalent: -841.876447 hartree
zpe.sumelectthermalfe: -841.950163 hartree
dipole: -1.9636 -2.8563 3.0244
dipole: 4.6001
quadrupole: -95.9798 -97.2009 -95.9597
quadrupole: 13.6753 4.3958 2.8820
quadrupole: 0.4003 -0.8208 0.4205 13.6753 4.3958 2.8820
hfenergy: -842.1740384 hartree
pointgroup: C01[X(C10H18O6)]
dipole: -0.4260365 -1.690622 -0.4855357 debye
polarizability: 147.9318364|17.2546812|114.0540904|-8.0275185|2.7112244|122.5253841 unknown
InChI: InChI=1S/C10H18O6/c11-5-6-15-7-8-16-10(14)4-2-1-3-9(12)13/h11-12H,1-8H2
charge 0 multiplicity 1
34 atoms
O  -0.882088 -0.432741 -0.074726
O  -3.80717 -0.798219 -0.156548
O  0.61916 0.681552 -1.462085
O  4.967986 1.232164 -2.200152
O  4.832676 3.075777 -0.794904
O  -4.679292 0.0057 2.381472
C  2.357004 1.278704 0.811876
C  3.372817 0.221994 0.322757
C  0.93822 0.704844 1.001615
C  4.814938 0.787833 0.160767
C  0.25969 0.342805 -0.311352
C  -1.673094 -0.804092 -1.281505
C  -2.833119 -1.666373 -0.81818
C  4.880066 1.833166 -0.933218
C  -4.921908 -1.528418 0.473031
C  -5.611543 -0.500284 1.372574
H  2.314458 2.118265 0.094244
H  2.700751 1.700033 1.776654
H  3.41774 -0.613606 1.04932
H  3.042843 -0.197804 -0.644976
H  0.940039 -0.188481 1.654145
H  0.288623 1.446744 1.507384
H  5.14444 1.259904 1.102435
H  5.504094 -0.036765 -0.090894
H  -2.032376 0.114751 -1.777021
H  -1.01851 -1.352573 -1.983091
H  -3.296197 -2.15923 -1.701797
H  -2.474086 -2.454071 -0.121788
H  -4.524432 -2.367687 1.08294
H  -5.61415 -1.929659 -0.29869
H  -6.444044 -0.96625 1.925933
H  -6.010398 0.326522 0.747816
H  4.943013 1.939797 -2.90022
H  -3.846052 0.243596 1.894483
