program: Gaussian 09
title: 000100909
version: EM64L-G09RevD.01
frameworkgroup: C1[X(C9H13NO8)]
method: RPBEPBE
basis: SDD
operation: Freq
keyword: #p
keyword: freq=noraman
keyword: PBEPBE/SDD
title: #p freq=noraman PBEPBE/SDD
converged: YES YES NO NO
title: Mulliken charges:
elementType: O O O O O O O O N C C C C C C C C C H H H H H H H H H H H H H
charge: -0.426012 -0.225992 -0.417771 -0.414577 -0.405976 -0.222730 -0.237183 -0.247146 -0.143101 -0.114073 -0.406052 -0.436869 -0.453201 -0.510756 0.166892 0.180155 0.221312 0.196929 0.299863 0.229866 0.228096 0.298565 0.230026 0.275380 0.259234 0.294164 0.257299 0.382605 0.382291 0.379164 0.379597
chargesum: 0.00000
title: Mulliken charges with hydrogens summed into heavy atoms:
elementType: O O O O O O O O N C C C C C C C C C
charge: -0.043407 -0.225992 -0.035480 -0.035413 -0.026379 -0.222730 -0.237183 -0.247146 -0.143101 0.185789 0.051911 0.091723 0.081412 0.040707 0.166892 0.180155 0.221312 0.196929
polarizability: 1.46224059e+02 7.11792671e-01 1.31560400e+02 7.87141475e+00 6.21363459e-01 1.03388539e+02
1716.lowfreq: -6.1086 -0.0005 -0.0003 0.0003 3.9909 7.8379 16.1329 29.2824 34.2406
frequency: 15.8360 29.2077 34.2210 37.8211 46.2144 48.7342 55.8888 58.7116 77.6763 105.5341 164.0800 204.2006 208.1424 218.4857 265.0524 275.5744 293.2655 310.7456 333.2006 382.0353 454.6156 460.6916 489.8185 490.2991 500.9447 525.4148 573.0198 589.0463 597.0286 616.7678 626.7980 642.2772 645.1997 666.2505 699.8398 749.8325 808.1543 841.9229 864.8664 883.8635 918.0464 970.3682 977.2943 994.7463 1016.8107 1034.8867 1039.4111 1048.1809 1056.3971 1092.6192 1167.0666 1181.8109 1187.0576 1210.9605 1245.1139 1253.6958 1262.7110 1266.7683 1274.3717 1296.9955 1317.1755 1330.8306 1372.1650 1385.2836 1389.7324 1413.3843 1432.2919 1438.0745 1439.3842 1460.3991 1654.8608 1668.5045 1677.4204 1680.8568 2871.3622 2900.7496 2995.8669 3005.5585 3051.7182 3061.9513 3065.0017 3068.2784 3087.7876 3503.0048 3511.7112 3520.0734 3520.3451
redmass: 7.8040 6.4088 7.1125 11.3721 10.8399 8.8511 6.0636 9.8857 7.3423 5.8091 4.1669 4.2610 3.5901 4.7502 2.5594 3.3866 4.3938 4.7138 5.6224 4.5479 3.1418 2.6072 2.3503 2.2343 2.1636 4.1056 3.5440 1.8898 2.2271 1.7511 1.4323 1.4477 2.7554 4.5883 3.5681 2.5519 4.2503 3.9176 4.1262 2.6147 4.3661 2.2828 2.4256 2.6774 3.3732 2.9305 2.5399 2.5870 2.2254 2.1340 1.7100 1.4186 1.8476 1.4275 1.4274 1.4940 1.6869 1.6198 1.2779 1.7750 1.5885 1.4240 1.8489 1.5158 1.6123 1.4576 1.0917 1.0953 1.1531 1.0893 7.8952 8.3606 8.5928 8.3441 1.0707 1.0702 1.0599 1.0627 1.0982 1.0979 1.0851 1.0882 1.0870 1.0640 1.0640 1.0641 1.0641
irintensity: 0.1974 0.1651 0.3427 0.9878 1.0953 0.8532 0.7283 0.3150 0.8362 4.3098 0.5681 6.2443 1.6366 2.7833 1.2995 6.4898 0.6050 3.5878 0.3178 3.2364 28.1967 31.0083 55.6335 34.8401 35.7826 39.3495 62.0789 72.5961 21.0751 87.8423 157.9089 98.5104 57.4514 14.7176 51.8002 15.0938 1.9070 8.2368 2.9324 13.5592 8.0966 50.2727 115.2760 62.1114 63.3017 573.6782 362.5440 57.0793 33.6548 117.2935 5.5117 19.8296 18.0462 3.9918 5.8636 22.1074 7.9382 21.1368 4.2499 10.3051 13.6650 5.0363 65.9843 17.2083 10.4892 20.2151 17.3207 38.4689 25.1068 23.5421 162.5670 239.0394 234.3957 225.3858 68.4554 36.0724 23.3418 18.0912 18.6219 3.9245 6.5929 5.9939 2.4008 23.2000 28.2065 31.4030 24.2562
temp: 298.150 k
press: 1.00000 atm
elementType: 8 8 8 8 8 8 8 8 7 6 6 6 6 6 6 6 6 6 1 1 1 1 1 1 1 1 1 1 1 1 1
symmnumber: 1
zpe: 599391.1 jmol-1
zpe.correction: 0.228296 hartree
zpe.thermalcorrener: 0.247847 hartree
zpe.thermalcorrenthalpy: 0.248791 hartree
zpe.thermalcorrgfe: 0.175857 hartree
zpe.sumelectzpe: -1005.912798 hartree
zpe.sumelectthermal: -1005.893247 hartree
zpe.sumelectthermalent: -1005.892303 hartree
zpe.sumelectthermalfe: -1005.965237 hartree
dipole: 2.7219 -1.1922 -2.5558
dipole: 3.9195
quadrupole: -93.7554 -97.7166 -103.9336
quadrupole: 0.9549 5.9274 0.8303
quadrupole: 4.7132 0.7519 -5.4651 0.9549 5.9274 0.8303
hfenergy: -1006.1410943 hartree
pointgroup: C01 [X(C9H13N1O8)]
dipole: 1.0651371 0.4729124 1.009811 debye
polarizability: 145.9745962|0.3636121|131.4457581|-8.6160788|1.5147531|103.7526439 unknown
InChI: InChI=1S/C9H13NO8/c11-6(12)2-1-5(9(17)18)10(3-7(13)14)4-8(15)16/h5,11,13,15,17H,1-4H2
charge 0 multiplicity 1
31 atoms
O  1.191211 2.160441 -1.757658
O  -1.045861 2.442351 -1.225804
O  -4.285837 0.869433 1.422267
O  -0.499056 -3.717765 -0.563215
O  4.639192 -0.004035 0.518196
O  -3.75546 -0.868084 -0.026827
O  0.037821 -1.909784 -1.91781
O  2.721078 -1.259602 0.867945
N  -0.955983 -0.122781 0.148386
C  0.284345 0.615152 -0.147943
C  1.081678 1.095231 1.126376
C  -1.959806 0.559121 0.966929
C  -0.76815 -1.553354 0.417839
C  2.599913 1.217814 0.899696
C  0.016181 1.803144 -1.074422
C  -3.382265 0.078898 0.693201
C  -0.374596 -2.346779 -0.82422
C  3.269551 -0.137473 0.767228
H  0.926441 -0.074492 -0.720103
H  0.898064 0.347254 1.920752
H  0.683661 2.061708 1.488388
H  -1.945609 1.635522 0.726168
H  -1.802486 0.470648 2.070614
H  -1.713914 -1.984541 0.782108
H  0.014386 -1.768651 1.184568
H  2.824622 1.80535 -0.009489
H  3.088056 1.747774 1.740136
H  1.001187 2.936758 -2.352446
H  -5.213325 0.555103 1.244094
H  -0.204561 -4.231397 -1.363338
H  5.049923 -0.907266 0.432183
