program: Gaussian 09
title: 000100886
version: EM64L-G09RevD.01
frameworkgroup: C1[X(C7H14O)]
method: RPBEPBE
basis: SDD
operation: Freq
keyword: #pfreq=noraman
keyword: PBEPBE/SDD
title: #p freq=noraman PBEPBE/SDD
converged: YES YES NO NO
title: Mulliken charges:
elementType: O C C C C C C C H H H H H H H H H H H H H H
charge: -0.436271 -0.031602 -0.502158 -0.136253 -0.697263 -0.185423 -0.434802 -0.670511 0.211554 0.202755 0.204101 0.225485 0.205996 0.242009 0.202196 0.214669 0.201530 0.208520 0.227665 0.215050 0.207559 0.325196
chargesum: 0.00000
title: Mulliken charges with hydrogens summed into heavy atoms:
elementType: O C C C C C C C
charge: -0.111076 0.179952 -0.095302 0.089232 -0.047062 0.029247 -0.024752 -0.020238
polarizability: 1.07185930e+02 -5.62543384e+00 6.67759367e+01 -5.04552220e+00 1.35979917e+00 6.98953721e+01
1716.lowfreq: -13.0612 -5.6467 -0.0009 -0.0009 0.0004 7.9919 28.7019 46.6969 105.2898
frequency: 28.6887 46.6869 105.2730 113.7998 170.9802 202.8682 217.6974 232.0102 298.7611 314.4937 402.2626 442.0016 451.4592 521.6112 762.4803 783.4320 826.0469 878.2396 909.8375 917.9210 969.6305 1000.1676 1017.7358 1061.2280 1070.7730 1099.0481 1106.5865 1141.3331 1176.6921 1238.3606 1262.8883 1279.2708 1293.3525 1298.8267 1325.3905 1347.6001 1366.7428 1383.2428 1384.5753 1444.5646 1463.2091 1464.7463 1472.6920 1474.4772 1484.5708 1688.6315 2948.8383 2964.2358 2973.4751 2976.7615 2999.8110 3025.4578 3028.3852 3058.8700 3068.3714 3072.3487 3079.8853 3084.2412 3093.8185 3548.3770
redmass: 2.6789 3.0115 2.4947 2.0823 1.4620 1.3726 1.1858 1.1746 2.3435 3.5264 2.6031 2.5888 2.2634 2.5187 1.6007 1.4751 2.1662 1.8774 1.8463 1.5466 1.1145 1.8669 1.6494 2.5845 1.8399 1.5393 2.2140 1.9381 1.7281 1.2442 1.2215 1.3247 1.3413 1.3279 1.4230 1.5324 1.1482 1.2238 1.2035 1.0894 1.0754 1.0553 1.0501 1.0437 1.0622 6.6324 1.0590 1.0619 1.0369 1.0356 1.0969 1.0964 1.0894 1.0930 1.0982 1.0993 1.0897 1.1004 1.0989 1.0659
irintensity: 1.1406 1.1137 0.4410 6.8725 66.4096 55.4764 0.2614 47.7243 0.2215 6.9140 2.3378 7.3257 8.3856 1.7430 7.6475 6.0203 15.1356 3.0774 8.2945 1.3345 53.7612 7.8436 64.7231 21.0026 8.6199 22.3437 10.3975 14.2006 3.9986 0.8941 2.4297 1.4371 3.8419 0.8498 8.3224 5.0514 25.7956 20.2921 8.5421 7.0548 7.1669 13.8532 10.4679 11.1569 10.9282 0.1451 30.4033 42.7149 31.5768 36.3089 11.1668 9.2482 19.6375 8.5288 56.2833 47.8356 65.9463 53.8245 31.5460 3.8818
temp: 298.150 k
press: 1.00000 atm
elementType: 8 6 6 6 6 6 6 6 1 1 1 1 1 1 1 1 1 1 1 1 1 1
symmnumber: 1
zpe: 507610.0 jmol-1
zpe.correction: 0.193338 hartree
zpe.thermalcorrener: 0.204215 hartree
zpe.thermalcorrenthalpy: 0.205159 hartree
zpe.thermalcorrgfe: 0.156137 hartree
zpe.sumelectzpe: -349.671633 hartree
zpe.sumelectthermal: -349.660756 hartree
zpe.sumelectthermalent: -349.659812 hartree
zpe.sumelectthermalfe: -349.708835 hartree
dipole: -0.0828 -1.4559 1.2597
dipole: 1.9269
quadrupole: -48.6760 -55.4651 -48.2036
quadrupole: -3.5345 1.2635 3.2396
quadrupole: 2.1055 -4.6835 2.5780 -3.5345 1.2635 3.2396
hfenergy: -349.8649714 hartree
pointgroup: C01 [X(C7H14O1)]
dipole: -0.0480787 0.5569006 -0.512145 debye
dipolederiv: -0.7561639 -0.0288306 0.0598532 -0.0032772 -0.7867996 -0.0185958 0.0789079 -0.0664374 -0.1317531 0.5971719 0.0608285 0.0073785 0.0317124 0.6373582 0.0401151 0.0912196 0.0772225 0.285011 -0.1407008 0.0705064 0.003709 0.0088805 0.0407049 0.0501303 -0.0750155 0.058314 0.0902669 0.0793084 0.0076911 -0.0118143 0.0981638 -0.2379385 0.0025402 -0.126553 0.0189256 0.122029 -0.2397401 -0.055345 0.0645941 0.0557066 -0.0046843 0.0153471 0.0557407 0.0375748 0.0535984 0.0959878 0.0950775 -0.0036696 0.0254415 -0.2826794 0.0013273 -0.0754557 -0.0345054 0.1239804 0.0093141 -0.0565897 0.0362473 -0.0857831 0.1320876 -0.034265 -0.0465426 -0.0238615 0.1100875 -0.0046476 -0.0485152 -0.0134461 0.0008739 -0.0016154 -0.0195209 0.0689414 -0.0097452 0.0932281 0.0393341 -0.0064534 0.0290232 -0.0102506 0.0026984 -0.0275472 -0.0066123 -0.0399548 -0.1629734 0.0272655 0.0209758 -0.0149748 0.0202362 0.0678187 -0.0646639 0.0364142 -0.0099022 -0.1663163 -0.0495301 -0.0869814 -0.0155958 -0.1064519 -0.135317 -0.0224771 0.0186507 -0.0451337 0.0873157 0.0322542 -0.016278 0.0269141 -0.035184 0.1529956 0.0058619 0.0505251 -0.0027788 -0.1297215 0.0621136 -0.0693872 0.004128 -0.1131517 -0.144374 -0.0469472 -0.0068075 -0.054724 0.0812928 -0.0790926 0.0906549 -0.043023 0.1311269 0.010171 0.0555153 -0.0540277 0.0594598 0.061587 0.0684967 -0.0189232 -0.0542779 -0.0095896 0.0893136 -0.0341652 0.0290327 -0.0259252 -0.171658 0.0261895 -0.0232419 0.0437967 -0.0041651 0.1546089 -0.0134717 0.0542162 0.0025093 -0.1537107 -0.112578 0.0926755 -0.0365781 0.1041519 -0.084159 0.0442127 -0.024138 0.0787175 0.070394 0.0482663 -0.030337 -0.0496064 -0.0347475 0.0523891 -0.025807 0.0321038 -0.0417879 -0.175079 0.0341102 0.1266254 -0.0536312 0.0708403 -0.0776932 0.0438773 -0.0530768 0.06197 0.0591195 -0.2132367 -0.0748133 0.0774164 -0.0736917 0.0585017 -0.0068665 0.0975101 0.0066249 0.061459 0.1059981 -0.0064166 0.0091279 -0.0032692 0.0617164 0.0003402 -0.0356094 -0.0495105 -0.1858954 0.3698793 -0.0429227 -0.0655711 -0.0675725 0.2948962 0.0550602 -0.1094241 0.0029483 -0.0222618 unknown
polarizability: 106.5270911|7.3338464|67.379224|5.3104677|1.7364658|69.9509237 unknown
InChI: InChI=1S/C7H14O/c1-3-4-5-6-7(2)8/h4-5,7-8H,3,6H2,1-2H3
charge 0 multiplicity 1
22 atoms
O  1.723618 -1.470552 0.27787
C  2.116407 -0.051988 0.410654
C  1.047083 0.897083 -0.191878
C  -0.338303 0.692379 0.382986
C  3.511935 0.187492 -0.195191
C  -1.467035 0.500134 -0.347632
C  -2.85446 0.290018 0.223491
C  -3.466165 -1.072459 -0.195508
H  2.155297 0.092861 1.506277
H  1.022448 0.769416 -1.294784
H  1.386998 1.938002 -0.004487
H  -0.411309 0.701363 1.482192
H  3.873605 1.209624 0.02526
H  4.232818 -0.536493 0.221407
H  3.492252 0.062021 -1.295099
H  -1.390976 0.476635 -1.448016
H  -3.526986 1.102176 -0.123435
H  -2.816455 0.358324 1.327619
H  -2.848887 -1.9090 0.177815
H  -4.489249 -1.189263 0.207245
H  -3.523924 -1.1590 -1.29695
H  1.434288 -1.632172 -0.656636
