program: Gaussian 09
title: 000100913
version: EM64L-G09RevD.01
frameworkgroup: C1[X(C14H26N4O2)]
method: RPBEPBE
basis: SDD
operation: Freq
keyword: #p
keyword: freq=noraman
keyword: PBEPBE/SDD
title: #p freq=noraman PBEPBE/SDD
converged: YES YES NO NO
title: Mulliken charges:
elementType: O O N N N N C C C C C C C C C C C C C C H H H H H H H H H H H H H H H H H H H H H H H H H H
charge: -0.328186 -0.327722 -0.390959 -0.390325 -0.653146 -0.653217 -0.371534 -0.371020 -0.357678 -0.359448 -0.402323 -0.404551 0.269465 0.268596 -0.515496 -0.515297 0.445351 0.445429 -0.804174 -0.804084 0.183088 0.196060 0.182299 0.198587 0.222321 0.189938 0.223663 0.190445 0.201287 0.254779 0.254562 0.202297 0.283953 0.284223 0.184126 0.183988 0.328149 0.223611 0.222100 0.221981 0.223850 0.327936 0.306549 0.311985 0.306558 0.311986
chargesum: 0.00000
title: Mulliken charges with hydrogens summed into heavy atoms:
elementType: O O N N N N C C C C C C C C C C C C C C
charge: -0.328186 -0.327722 -0.107006 -0.106103 -0.034612 -0.034674 0.007614 0.009866 0.054580 0.054659 0.053743 0.052307 0.269465 0.268596 -0.331369 -0.331309 0.445351 0.445429 -0.030314 -0.030318
polarizability: 1.95910408e+02 -1.35740052e+00 2.53190893e+02 -9.00796842e+00 -2.69780387e-01 1.69526593e+02
1716.lowfreq: -12.4358 -0.6357 -0.0003 0.0002 0.0006 2.8401 7.2089 15.7379 18.4098
frequency: 6.9545 15.6062 17.9535 29.6799 32.0050 57.5201 63.9807 68.7499 70.0898 96.6048 98.2006 101.5079 117.6713 119.4672 146.6084 186.6388 187.3194 192.8086 225.1903 291.1049 310.5976 318.1469 332.8692 371.2146 373.6347 375.1770 380.2379 381.1597 389.7287 456.3158 465.4908 466.5781 473.8269 484.5629 485.2600 511.1068 531.1816 534.6443 538.4183 700.7247 703.9426 710.6732 712.2672 729.3413 764.6533 822.8812 823.9919 832.0906 842.6161 844.2752 885.2082 895.5859 913.4541 940.7300 974.4675 988.1727 1015.6183 1016.2563 1049.7287 1051.1861 1057.7171 1058.1401 1078.0860 1080.7562 1100.5946 1114.3323 1127.5638 1132.6825 1150.3614 1178.7591 1186.6294 1215.0164 1240.7693 1258.0222 1284.1867 1284.7416 1289.1714 1316.5075 1335.7117 1335.9751 1343.7852 1346.8130 1367.3840 1368.8686 1385.0604 1385.8674 1418.4969 1418.5270 1439.2554 1440.4729 1449.3833 1450.0661 1452.0374 1456.1802 1463.4160 1478.3615 1481.1798 1482.2933 1498.2516 1498.8417 1575.5459 1575.8187 1633.1164 1633.3212 1656.7601 1658.8686 2943.7322 2949.7935 2968.0100 2968.6364 2968.9110 2969.2892 2979.7076 2981.6525 2986.0647 3009.2684 3037.8777 3045.4577 3049.9284 3050.2275 3069.6693 3069.9621 3076.1171 3076.4363 3103.7841 3104.0133 3544.5192 3544.6620 3561.2607 3561.2682 3688.6335 3688.7718
redmass: 5.1170 4.1058 4.2010 4.2568 3.6805 5.1808 2.8900 2.1380 2.7206 1.1881 1.1918 3.7368 2.2251 2.6121 3.9910 4.1958 3.4447 2.9652 4.1195 4.2689 3.8826 3.4223 2.3108 1.1672 1.1645 2.9404 4.7769 4.7987 2.4385 1.8852 1.2027 1.2216 1.2604 2.0530 1.5388 2.6175 2.0008 1.8411 2.1427 2.4397 3.4825 4.3004 4.2507 1.2809 1.4275 1.6576 1.6470 1.8523 4.0634 4.0526 2.3392 2.8530 2.1150 2.3104 1.8648 1.6606 1.7118 1.6797 2.7917 2.5298 1.5081 1.5061 2.0854 2.0433 2.6255 2.0603 1.7521 1.7579 1.4274 1.7355 2.0268 1.4223 1.3194 1.3255 1.1727 1.0624 1.2326 1.2941 2.0883 2.1880 1.5640 1.7692 1.4076 1.4240 1.2132 1.2151 2.1232 2.1249 1.2273 1.2238 1.0777 1.0780 1.0876 1.0769 1.0896 1.3035 1.3929 1.7233 1.0472 1.0471 4.6287 4.6585 1.2667 1.2688 4.0832 4.1788 1.0584 1.0596 1.0617 1.0388 1.0381 1.0617 1.0661 1.0661 1.0927 1.0999 1.1003 1.1015 1.0975 1.0975 1.0976 1.0982 1.0887 1.0887 1.0993 1.0992 1.0450 1.0450 1.0773 1.0773 1.1037 1.1037
irintensity: 0.2182 2.5712 2.1064 12.8468 0.1164 2.4215 16.0966 1.5741 0.3723 0.3136 0.3308 2.5323 0.0234 0.1137 0.2817 1.7733 1.0455 5.0333 3.3774 3.9909 10.0156 11.5483 7.0464 227.4748 74.4656 4.4435 5.6489 0.6039 31.9323 24.4837 106.4300 18.6421 226.5807 57.4667 36.5922 19.7923 1.0851 2.6199 35.2680 0.1106 0.9842 0.1270 0.1321 23.3077 4.4661 102.0042 48.8141 46.5394 3.1556 2.1782 7.7392 13.9712 0.4894 2.8054 4.9157 0.3590 8.6315 8.0148 7.0471 1.3009 2.5486 2.5472 21.6388 6.8318 0.4661 9.9256 10.7648 5.7551 1.7832 156.3182 355.8853 33.8082 4.8405 83.8696 15.1955 9.6841 32.1526 40.6934 1.2344 14.2167 4.3438 0.2680 4.8286 5.1523 66.7261 53.6817 87.6995 43.0213 98.6886 29.2423 30.9768 13.7427 0.8405 7.3572 3.7319 84.7937 82.7425 354.5976 20.5663 19.9342 74.3529 233.2834 50.8878 43.5400 288.5200 919.0765 2.0140 38.7476 31.0760 60.7998 78.9507 74.2645 49.3520 58.3176 13.8087 5.0161 0.4061 182.2497 25.8681 23.3811 5.4923 5.7791 25.7492 32.5484 7.8405 8.1449 52.2259 78.0216 12.2119 9.2389 19.7680 19.7937
temp: 298.150 k
press: 1.00000 atm
elementType: 8 8 7 7 7 7 6 6 6 6 6 6 6 6 6 6 6 6 6 6 1 1 1 1 1 1 1 1 1 1 1 1 1 1 1 1 1 1 1 1 1 1 1 1 1 1
symmnumber: 1
zpe: 1033005.5 jmol-1
zpe.correction: 0.393451 hartree
zpe.thermalcorrener: 0.418318 hartree
zpe.thermalcorrenthalpy: 0.419262 hartree
zpe.thermalcorrgfe: 0.332906 hartree
zpe.sumelectzpe: -916.986217 hartree
zpe.sumelectthermal: -916.961350 hartree
zpe.sumelectthermalent: -916.960406 hartree
zpe.sumelectthermalfe: -917.046762 hartree
dipole: -0.0098 4.4337 0.0206
dipole: 4.4338
quadrupole: -126.6502 -90.0203 -117.8850
quadrupole: -0.5524 36.7784 0.0109
quadrupole: -15.1317 21.4982 -6.3665 -0.5524 36.7784 0.0109
hfenergy: -917.3796681 hartree
pointgroup: C01 [X(C14H26N4O2)]
dipole: -0.0316309 -1.7440442 -0.0143449 debye
polarizability: 196.1193853|-0.3002511|253.2056398|8.6462575|1.1901959|169.3028692 unknown
InChI: InChI=1S/C14H26N4O2/c1-11(15)9-13(19)17-7-5-3-4-6-8-18-14(20)10-12(2)16/h9-10,17-18H,3-8,15-16H2,1-2H3
charge 0 multiplicity 1
46 atoms
O  4.674491 0.212565 1.355561
O  -4.703337 0.399497 -1.296286
N  3.595204 1.232061 -0.432337
N  -3.643635 1.372503 0.528584
N  5.376531 -3.110898 -1.492872
N  -5.480476 -2.972302 1.47701
C  0.710677 2.466658 -0.221265
C  -0.730727 2.472063 0.336901
C  1.787941 2.411978 0.884165
C  -1.810141 2.536746 -0.765556
C  3.241499 2.424096 0.349875
C  -3.260726 2.575006 -0.223542
C  4.298778 0.158435 0.1302
C  -4.348747 0.317713 -0.066223
C  4.538144 -0.954609 -0.80579
C  -4.614601 -0.810252 0.844593
C  5.21621 -2.126942 -0.52168
C  -5.294831 -1.972506 0.526615
C  5.838483 -2.464023 0.818614
C  -5.892985 -2.281847 -0.831146
H  0.865245 3.374631 -0.842844
H  0.826987 1.594932 -0.89855
H  -0.85161 3.336606 1.024739
H  -0.879841 1.557392 0.947319
H  1.650446 1.503768 1.502572
H  1.662923 3.28306 1.560809
H  -1.712618 1.665743 -1.44245
H  -1.649942 3.444188 -1.384336
H  3.405043 3.326151 -0.27363
H  3.945305 2.455529 1.199884
H  -3.966444 2.65137 -1.069117
H  -3.395716 3.462355 0.426949
H  3.284243 1.166147 -1.401759
H  -3.346839 1.282805 1.500521
H  4.137711 -0.832435 -1.823894
H  -4.233005 -0.709411 1.872234
H  5.660719 -1.638539 1.523719
H  6.928769 -2.621615 0.708031
H  5.398537 -3.395317 1.224807
H  -5.452185 -3.209601 -1.244439
H  -6.986342 -2.43278 -0.744372
H  -5.695414 -1.445959 -1.518478
H  5.000642 -2.99374 -2.431311
H  5.87831 -3.968202 -1.277934
H  -5.122034 -2.874204 2.424421
H  -5.981841 -3.823117 1.236789
