program: Gaussian 09
title: 000100867
version: EM64L-G09RevD.01
frameworkgroup: C1[X(C8H16N2O2)]
method: RPBEPBE
basis: SDD
operation: Freq
keyword: #p
keyword: freq=noraman
keyword: PBEPBE/SDD
title: #p freq=noraman PBEPBE/SDD
converged: YES YES NO NO
title: Mulliken charges:
elementType: O O N N C C C C C C C C H H H H H H H H H H H H H H H H
charge: -0.318170 -0.310451 -0.132871 -0.600243 -0.038348 -0.399314 -0.399691 -0.410152 -0.407382 0.313633 -0.207606 -0.678094 0.177898 0.229707 0.190419 0.189422 0.227326 0.208716 0.261323 0.261676 0.204107 0.261863 0.263022 0.223945 0.225911 0.210076 0.226782 0.226496
chargesum: 0.00000
title: Mulliken charges with hydrogens summed into heavy atoms:
elementType: O O N N C C C C C C C C
charge: -0.318170 -0.310451 -0.132871 -0.075359 0.139551 0.020812 0.017057 0.059887 0.058401 0.313633 0.242249 -0.014740
polarizability: 1.37780102e+02 -6.42150825e-01 1.03561107e+02 2.19205927e+00 -2.46148474e+00 8.10594035e+01
1716.lowfreq: -18.2895 0.0009 0.0010 0.0011 9.8571 10.8276 34.6596 44.9452 96.8509
frequency: 33.4891 44.7634 96.8368 109.8971 118.6192 178.7940 195.1959 242.5416 250.3549 296.1116 301.9580 330.7904 338.1288 359.9520 455.6868 472.6598 496.1667 549.7930 601.9596 639.3225 691.7009 765.1754 800.3654 805.7625 812.7076 848.6418 921.6837 968.6662 970.1651 988.7365 1035.2071 1045.2803 1061.5231 1108.2526 1115.4875 1124.5093 1138.6952 1145.4029 1155.6056 1205.5400 1238.7443 1246.6254 1252.1477 1268.6808 1297.8133 1312.4597 1338.2845 1346.2188 1362.5524 1372.7036 1379.6020 1397.6059 1415.7200 1452.7406 1463.4290 1466.1353 1473.2291 1476.6254 1477.7900 1491.1367 1635.6161 1638.9885 2826.7480 2948.5520 2953.1469 2983.4934 2986.9119 2993.8688 3009.6365 3053.0622 3058.7716 3066.7257 3090.5204 3092.6385 3104.7878 3116.4993 3443.9442 3572.0300
redmass: 3.9181 2.1752 4.1504 3.0751 3.6057 3.2477 2.2014 1.1895 1.1894 2.3665 3.7033 2.5708 2.7835 3.7696 1.9451 2.9273 3.7941 3.2464 1.5404 2.5369 10.7579 5.3593 1.0957 1.5883 2.3003 2.9155 1.9211 1.7585 1.8069 2.7885 2.3526 1.7146 2.8389 2.4072 2.7572 2.3901 1.4565 1.5833 1.4617 1.6531 1.8848 1.1344 1.2860 1.6205 1.3282 1.3823 1.2518 1.3104 1.5222 1.4791 1.6760 1.2927 2.5354 1.0903 1.0411 1.0898 1.0787 1.0599 1.0863 1.0813 1.7319 2.3155 1.0808 1.0713 1.0707 1.0613 1.0625 1.0357 1.0582 1.1005 1.1000 1.1065 1.0984 1.0926 1.1027 1.0911 1.0447 1.0975
irintensity: 0.3664 0.0481 4.3804 3.7634 2.1742 1.0488 0.7658 34.2250 0.8845 16.2980 0.8796 5.0580 5.5678 12.2767 9.6940 0.4524 18.1375 42.6564 150.1981 13.9540 15.5412 20.2062 3.1536 2.2457 3.8212 4.5692 16.9076 3.8051 6.3546 49.6600 62.3267 37.3913 88.2262 47.7542 74.8803 12.4297 5.2403 0.8411 0.7269 319.3358 23.1086 0.0351 7.0854 33.2168 33.2311 3.5831 1.8175 21.0242 27.9888 23.1750 3.9130 50.6731 106.9839 6.3233 13.1632 12.8861 8.3745 6.5254 18.3152 9.3922 327.4434 147.5464 95.5231 26.0757 87.0775 63.7182 28.8711 22.4029 26.9239 16.4788 67.2214 8.3823 35.1501 5.5440 51.2691 4.2166 2.8928 0.0810
temp: 298.150 k
press: 1.00000 atm
elementType: 8 8 7 7 6 6 6 6 6 6 6 6 1 1 1 1 1 1 1 1 1 1 1 1 1 1 1 1
symmnumber: 1
zpe: 633592.0 jmol-1
zpe.correction: 0.241322 hartree
zpe.thermalcorrener: 0.254435 hartree
zpe.thermalcorrenthalpy: 0.255379 hartree
zpe.thermalcorrgfe: 0.201237 hartree
zpe.sumelectzpe: -573.437305 hartree
zpe.sumelectthermal: -573.424193 hartree
zpe.sumelectthermalent: -573.423249 hartree
zpe.sumelectthermalfe: -573.477391 hartree
dipole: 1.9088 -2.3236 1.5683
dipole: 3.3915
quadrupole: -57.6573 -76.7321 -74.9682
quadrupole: 4.8779 4.4307 0.1152
quadrupole: 12.1285 -6.9462 -5.1823 4.8779 4.4307 0.1152
hfenergy: -573.6786276 hartree
pointgroup: C01 [X(C8H16N2O2)]
dipole: -0.760354 -0.8945686 -0.6340668 debye
polarizability: 137.7706254|0.1396661|103.4705923|2.4743695|2.7747973|81.1593948 unknown
InChI: InChI=1S/C8H16N2O2/c1-2-12-8(11)10-5-3-7(9)4-6-10/h7H,2-6,9H2,1H3
charge 0 multiplicity 1
28 atoms
O  2.076079 -0.388673 -0.082409
O  1.59811 1.879326 0.314536
N  -0.070572 0.393241 -0.415499
N  -4.017976 -0.802204 0.685809
C  -2.875065 -0.372533 -0.142177
C  -2.357718 0.998687 0.348852
C  -1.736776 -1.414128 -0.0452
C  -1.112433 1.442089 -0.448626
C  -0.491722 -0.958951 -0.839118
C  1.212436 0.728918 -0.036893
C  3.481288 -0.100121 0.319011
C  4.238537 -1.421696 0.229307
H  -3.137062 -0.26257 -1.227914
H  -2.112958 0.916491 1.424106
H  -3.148105 1.768575 0.241033
H  -2.077369 -2.393371 -0.438195
H  -1.480559 -1.550469 1.022096
H  -1.392363 1.63927 -1.505816
H  -0.674397 2.363792 -0.034451
H  0.348694 -1.650998 -0.690359
H  -0.730641 -0.937142 -1.924538
H  -4.368752 -1.739999 0.463938
H  -4.775973 -0.113919 0.744835
H  3.891714 0.668251 -0.360824
H  3.478915 0.315573 1.342722
H  5.294912 -1.267829 0.516113
H  3.800766 -2.173625 0.908256
H  4.21289 -1.822684 -0.798596
