program: Gaussian 09
title: 000100885
version: EM64L-G09RevD.01
frameworkgroup: C1[X(C11H22O3)]
method: RPBEPBE
basis: SDD
operation: Freq
keyword: #pfreq=noraman
keyword: PBEPBE/SDD
title: #p freq=noraman PBEPBE/SDD
converged: YES YES NO NO
title: Mulliken charges:
elementType: O O O C C C C C C C C C C C H H H H H H H H H H H H H H H H H H H H H H
charge: -0.270395 -0.303770 -0.426576 -0.145287 -0.417689 -0.349918 -0.398826 -0.353991 0.253628 -0.703897 0.265365 -0.697841 -0.697669 -0.688878 0.230042 0.217185 0.196832 0.199556 0.190698 0.222720 0.204082 0.193533 0.199496 0.211148 0.215757 0.236609 0.217319 0.210106 0.210295 0.232764 0.225940 0.252305 0.222427 0.249521 0.216821 0.380586
chargesum: 0.00000
title: Mulliken charges with hydrogens summed into heavy atoms:
elementType: O O O C C C C C C C C C C C
charge: -0.270395 -0.303770 -0.045990 0.084755 -0.003672 0.040336 0.027977 0.039038 0.253628 -0.040383 0.265365 -0.060121 0.013340 -0.000108
polarizability: 1.41652211e+02 -3.20218524e+00 1.36657834e+02 -2.03874294e+00 2.08051755e+00 1.11793498e+02
1716.lowfreq: -11.9979 -4.2668 -0.0011 -0.0009 -0.0005 4.7095 15.0579 33.0973 55.5949
frequency: 14.9623 32.9587 55.2707 66.6028 87.0688 102.0730 121.4065 131.7633 151.1737 175.0972 177.8154 206.6578 226.8208 239.2914 242.1784 288.2011 294.0931 302.5603 336.5164 348.5136 411.1911 431.8775 463.4091 475.0195 518.0677 622.4816 645.8295 679.2377 714.6496 731.7406 782.1265 788.4338 799.5919 850.0056 886.7816 912.6140 929.5488 941.1806 965.1833 990.5343 998.3424 1035.9300 1049.0182 1071.6012 1081.3514 1085.7998 1104.5044 1119.0785 1140.7824 1159.4652 1180.4154 1209.0552 1224.0593 1240.9992 1261.2929 1272.6478 1289.9125 1290.6633 1328.5308 1330.2272 1353.1014 1363.5721 1372.5603 1384.8138 1390.0965 1397.1152 1406.5069 1453.7947 1455.1861 1460.1948 1464.1311 1466.0006 1471.7550 1476.0722 1477.3253 1479.8206 1480.1537 1484.7563 1486.8136 1588.9461 2957.2052 2966.4138 2972.1596 2975.4631 2978.7882 2985.4740 2996.4289 2999.2020 3012.6854 3013.2006 3021.9461 3038.9946 3049.0880 3068.5065 3071.6733 3076.9394 3077.6232 3100.4553 3107.8257 3116.7509 3125.9014 3404.8419
redmass: 3.9502 3.5044 1.7992 2.4183 3.4493 2.1710 2.4459 4.1939 3.2150 1.3528 1.4919 2.8650 1.1653 1.2727 1.1150 3.0374 3.6288 3.0579 3.5918 3.2364 2.9009 3.0250 3.3910 3.1488 3.0217 1.5689 1.7768 5.8274 2.0318 1.3709 1.3576 3.3499 2.0724 2.0506 2.0055 1.5002 1.4437 1.5465 2.0278 3.4581 1.3797 1.4564 3.1839 2.2416 2.0824 1.9931 2.2935 1.7060 2.5657 1.8930 2.4060 1.4931 3.1013 1.2752 1.2404 1.2536 1.1804 1.1004 1.4177 1.3880 1.6022 1.5631 1.2357 1.3414 1.2174 1.2095 1.5287 1.0751 1.0777 1.0525 1.0810 1.0842 1.1076 1.0660 1.0441 1.0503 1.0478 1.0496 1.0819 6.5532 1.0587 1.0596 1.0362 1.0594 1.0358 1.0601 1.0978 1.0353 1.0358 1.0886 1.0998 1.1025 1.1007 1.1008 1.0992 1.0996 1.1006 1.0999 1.1010 1.0999 1.1009 1.0643
irintensity: 0.7568 0.6548 0.1608 0.5167 0.9641 0.5763 0.5865 1.0368 0.3221 0.6118 0.6935 0.1337 0.4687 0.5160 0.0438 1.4349 1.0707 5.0298 5.8302 12.4933 0.8417 4.1214 5.1527 12.6092 3.6799 94.5169 124.9453 73.7301 35.3736 4.4942 7.9555 28.2838 11.6784 10.9070 4.9243 6.6206 0.7300 26.5904 33.7546 5.1022 8.5974 2.0137 3.3432 30.7251 66.7351 235.0694 6.2386 11.2340 4.9329 123.3774 61.8919 4.8430 89.5628 3.9609 7.1372 8.0448 0.3689 1.2466 1.4463 7.3254 14.1356 26.5285 32.9312 53.5473 8.8590 12.1824 78.4305 7.9646 0.8189 0.5133 8.0551 9.9222 16.2535 4.3495 7.8352 22.1732 12.5453 13.7501 18.4697 103.6071 3.8108 24.7594 36.9107 56.2435 33.7955 47.5745 0.9681 9.8750 9.5005 9.3259 10.7788 5.6649 39.9713 85.2134 54.6782 50.7856 60.2306 13.1915 12.1441 25.1788 17.3414 51.7265
temp: 298.150 k
press: 1.00000 atm
elementType: 8 8 8 6 6 6 6 6 6 6 6 6 6 6 1 1 1 1 1 1 1 1 1 1 1 1 1 1 1 1 1 1 1 1 1 1
symmnumber: 1
zpe: 823296.9 jmol-1
zpe.correction: 0.313577 hartree
zpe.thermalcorrener: 0.331622 hartree
zpe.thermalcorrenthalpy: 0.332566 hartree
zpe.thermalcorrgfe: 0.266364 hartree
zpe.sumelectzpe: -656.900636 hartree
zpe.sumelectthermal: -656.882592 hartree
zpe.sumelectthermalent: -656.881647 hartree
zpe.sumelectthermalfe: -656.947849 hartree
dipole: -1.7473 -0.6609 -1.4278
dipole: 2.3513
quadrupole: -92.1883 -81.1610 -89.8738
quadrupole: -3.3898 -1.8865 -0.9677
quadrupole: -4.4473 6.5801 -2.1327 -3.3898 -1.8865 -0.9677
hfenergy: -657.2142134 hartree
pointgroup: C01 [X(C11H22O3)]
dipole: -0.6943185 0.2952804 0.5352172 debye
polarizability: 141.6637602|3.1817808|136.6819542|2.5645514|1.0453596|111.7578283 unknown
InChI: InChI=1S/C11H22O3/c1-5-7-8-9(6-2)10(12)14-11(3,4)13/h9,13H,5-8H2,1-4H3
charge 0 multiplicity 1
36 atoms
O  1.149954 0.352661 0.646283
O  0.710374 -0.421742 -1.511962
O  3.096243 0.657536 -0.807999
C  -0.518961 -1.383235 0.3984
C  -1.95024 -1.051847 -0.114781
C  -2.435466 0.37257 0.233789
C  -0.14004 -2.8615 0.096521
C  -3.883566 0.640032 -0.236607
C  0.488859 -0.453357 -0.26539
C  1.227502 -3.283722 0.674641
C  2.216561 1.34499 0.08903
C  -4.372601 2.065653 0.097145
C  1.448766 2.500729 -0.575208
C  3.018818 1.740178 1.321146
H  -0.468332 -1.206925 1.489591
H  -1.973161 -1.196244 -1.213235
H  -2.647429 -1.794079 0.323883
H  -1.761833 1.122767 -0.230076
H  -2.368722 0.530165 1.330335
H  -0.147183 -3.006457 -1.001071
H  -0.937801 -3.506423 0.514714
H  -4.561798 -0.103479 0.230256
H  -3.946053 0.472942 -1.331229
H  1.257206 -3.150866 1.772268
H  1.434143 -4.347084 0.455916
H  2.051329 -2.687149 0.241777
H  -5.409486 2.229182 -0.249641
H  -3.731388 2.827631 -0.385014
H  -4.348025 2.248744 1.188097
H  2.174788 3.251641 -0.93255
H  0.76997 2.981744 0.14906
H  0.861109 2.142998 -1.437098
H  3.793158 2.471592 1.034906
H  3.511267 0.84937 1.741773
H  2.359997 2.185997 2.083715
H  2.543842 0.328588 -1.574783
