program: Gaussian 09
title: 000100929
version: EM64L-G09RevD.01
frameworkgroup: C1[X(C12H12I3N3O5)]
method: RPBEPBE
basis: SDD
operation: Freq
keyword: #p
keyword: freq=noraman
keyword: PBEPBE/SDD
title: #p freq=noraman PBEPBE/SDD
converged: YES YES NO NO
title: Mulliken charges:
elementType: I I I O O O O O N N N C C C C C C C C C C C C H H H H H H H H H H H H
charge: 0.162333 0.177488 0.173871 -0.215746 -0.443111 -0.368693 -0.224800 -0.172783 -0.495190 -0.310990 -0.595118 0.547095 0.794094 -0.691616 0.679291 -0.755770 -0.739906 0.040580 -0.337763 -0.348404 0.200105 -0.028084 -0.445434 0.256780 0.227534 0.325175 0.353418 0.206378 0.242801 0.230007 0.219005 0.322079 0.277141 0.344986 0.393249
chargesum: 0.00000
title: Mulliken charges with hydrogens summed into heavy atoms:
elementType: I I I O O O O O N N N C C C C C C C C C C C C
charge: 0.162333 0.177488 0.173871 -0.215746 -0.098126 0.024556 -0.224800 -0.172783 -0.170015 0.042427 0.004102 0.547095 0.794094 -0.691616 0.679291 -0.755770 -0.739906 0.040580 0.146551 0.100775 0.200105 -0.028084 0.003578
polarizability: 3.10544105e+02 7.80442259e+00 2.96890421e+02 4.86492577e+00 -1.00254953e+01 1.51383241e+02
1716.lowfreq: -7.0642 -4.8681 0.0002 0.0003 0.0003 3.1627 16.9594 18.5330 23.5772
frequency: 16.4192 18.4098 23.5074 30.1098 42.8537 46.8316 52.5166 55.9319 63.6115 72.8052 80.7850 88.0259 92.3980 98.1741 122.4861 133.3876 153.0547 161.5891 182.5044 191.5688 193.5527 197.7231 243.0962 253.3329 277.0437 292.1137 315.3049 341.9901 351.1359 405.3220 417.2867 423.9425 445.5573 494.6731 506.9653 522.3439 545.7888 579.0028 594.9066 618.2627 625.8120 646.9443 665.3850 673.1906 693.4027 705.9772 746.1699 754.0567 778.5007 829.9825 883.7267 900.9552 920.3541 970.7154 991.2794 1015.1471 1020.6693 1043.4962 1054.5151 1098.3242 1117.5791 1158.4091 1169.6387 1199.0645 1202.9226 1210.4190 1232.8062 1250.4743 1306.1569 1316.5374 1322.5746 1341.3562 1357.2420 1359.7883 1373.7757 1377.1452 1452.9857 1462.5538 1472.1399 1474.7306 1481.7257 1524.2913 1529.7513 1603.3400 1604.3307 1652.3546 1661.6492 2875.1487 2934.3705 2960.3470 2993.8176 3059.5669 3098.7057 3480.9231 3500.8724 3507.7577 3511.1945 3562.1563 3629.7589
redmass: 6.6831 7.4361 10.1071 6.2528 10.2032 10.3112 5.2598 3.6743 8.1870 2.5663 4.9495 11.2580 32.1915 33.2200 9.3910 5.9622 5.4535 96.8574 6.6522 2.8181 2.4427 3.0475 7.4050 6.3598 4.7542 4.9880 2.7183 5.7643 1.1492 7.3166 9.8270 6.0149 5.6463 2.0537 2.8120 1.5325 3.0879 1.8830 1.5340 6.0253 5.4371 4.4773 2.5711 3.7064 2.2934 4.8604 5.1597 8.9678 8.5528 2.4393 3.2553 5.6890 5.8873 4.9335 2.0939 6.5026 1.9645 2.1067 3.1919 4.0694 1.7114 1.6932 1.3567 2.3601 1.3692 1.4238 1.7548 1.9977 5.8183 3.7612 1.3848 5.5576 1.6838 4.9153 1.5345 1.2025 2.1674 1.0855 1.0807 1.0871 2.1003 9.0573 10.9743 8.8847 1.6074 10.1033 2.3266 1.0692 1.0876 1.0684 1.0665 1.0927 1.1000 1.0474 1.0639 1.0782 1.0764 1.0663 1.0971
irintensity: 2.4687 0.6975 0.4027 1.4139 0.3425 1.4900 6.2144 3.2152 3.1274 3.8490 1.3545 4.3059 0.8860 1.4846 0.2240 3.1453 2.4039 0.0715 14.2526 16.7423 17.5277 14.2284 11.3561 4.7505 0.5480 12.2358 21.4252 35.0680 155.5868 5.3959 4.7049 7.9934 26.7162 7.1833 16.6166 215.4556 7.9731 203.3385 34.4369 27.8833 6.7869 52.8383 49.7856 22.2070 31.5265 18.8280 9.3187 9.1985 8.7864 5.4758 9.0781 14.3849 11.0325 76.2116 7.9539 60.2412 32.6954 5.5941 310.0037 4.2847 21.4620 57.2065 26.6296 35.1469 18.1380 35.9828 33.3952 110.0602 8.9942 18.0343 18.3590 27.3400 19.5422 192.0917 17.4856 10.8639 329.0523 20.1446 27.6517 9.3921 263.1004 95.6005 39.5228 152.6912 213.6089 235.0633 25.3154 69.7370 56.8160 41.3422 76.6483 8.7881 21.7806 12.6337 40.6033 67.0757 27.0520 5.9061 18.0313
temp: 298.150 k
press: 1.00000 atm
elementType: 53 53 53 8 8 8 8 8 7 7 7 6 6 6 6 6 6 6 6 6 6 6 6 1 1 1 1 1 1 1 1 1 1 1 1
symmnumber: 1
zpe: 616646.7 jmol-1
zpe.correction: 0.234868 hartree
zpe.thermalcorrener: 0.261394 hartree
zpe.thermalcorrenthalpy: 0.262338 hartree
zpe.thermalcorrgfe: 0.170450 hartree
zpe.sumelectzpe: -1037.652503 hartree
zpe.sumelectthermal: -1037.625977 hartree
zpe.sumelectthermalent: -1037.625033 hartree
zpe.sumelectthermalfe: -1037.716921 hartree
dipole: -1.0079 1.2889 1.4672
dipole: 2.1977
quadrupole: -142.6437 -159.6400 -192.0164
quadrupole: 1.3746 -22.2024 -16.8603
quadrupole: 22.1230 5.1267 -27.2498 1.3746 -22.2024 -16.8603
hfenergy: -1037.8873714 hartree
pointgroup: C01 [X(C12H12I3N3O5)]
dipole: -0.3980375 -0.6140634 -0.4605513 debye
polarizability: 310.1283926|-7.9409349|285.326206|1.1575378|-41.6031118|163.3631683 unknown
InChI: InChI=1S/C12H12I3N3O5/c13-7-5(11(21)17-1-2-19)8(14)10(18-4(20)3-16)9(15)6(7)12(22)23/h17-19,22H,1-3,16H2
charge 0 multiplicity 1
35 atoms
I  -0.361517 -2.327116 1.836396
I  -2.330403 3.033578 -0.465887
I  3.703234 1.820012 -0.188985
O  -3.0262 0.267069 1.934498
O  -4.111059 -2.225797 -2.335316
O  0.957417 3.572408 -2.029393
O  2.025512 -2.477035 -0.800486
O  1.119795 4.51508 0.09241
N  2.483535 -0.967772 0.927924
N  -3.069379 -0.661696 -0.205289
N  4.381802 -3.845426 -0.37739
C  -1.018864 0.411725 0.550706
C  1.407778 -0.076452 0.654313
C  0.054802 -0.450407 0.884304
C  0.615237 2.12622 -0.153828
C  -0.721127 1.694773 0.03134
C  1.664738 1.22671 0.1465
C  -2.461267 0.004018 0.831143
C  -4.451763 -1.148965 -0.124705
C  -4.588179 -2.435142 -0.953651
C  2.735103 -2.125806 0.179364
C  0.919412 3.523405 -0.636754
C  3.932537 -2.947274 0.679743
H  -4.694062 -1.329123 0.938015
H  -5.154748 -0.373489 -0.496892
H  3.203126 -0.662502 1.589006
H  -2.569283 -0.842255 -1.082154
H  -5.636884 -2.793414 -0.936223
H  -3.929053 -3.222555 -0.554637
H  3.582574 -3.470458 1.604172
H  4.738289 -2.250199 0.99945
H  3.684246 -3.976135 -1.116757
H  4.848698 -4.699434 -0.074285
H  -4.764654 -1.668076 -2.828994
H  1.157608 4.502932 -2.325858
