program: Gaussian 09
title: 000100851
version: EM64L-G09RevD.01
frameworkgroup: C1[X(C4H8O2S)]
method: RPBEPBE
basis: SDD
operation: Freq
keyword: #pfreq=noraman
keyword: PBEPBE/SDD
title: #p freq=noraman PBEPBE/SDD
converged: YES YES NO NO
title: Mulliken charges:
elementType: S O O C C C C H H H H H H H H
charge: 0.180028 -0.427419 -0.222192 -0.466839 -0.661300 0.262678 -0.843373 0.290221 0.249130 0.235397 0.225648 0.251849 0.291816 0.256324 0.378031
chargesum: 0.00000
title: Mulliken charges with hydrogens summed into heavy atoms:
elementType: S O O C C C C
charge: 0.180028 -0.049388 -0.222192 -0.176618 0.048875 0.262678 -0.043383
polarizability: 8.24756786e+01 -5.93909610e+00 6.74815503e+01 1.08505148e+00 -3.13636784e+00 5.17699191e+01
1716.lowfreq: -11.9331 -10.8368 -0.0014 -0.0006 0.0022 7.1668 64.5837 84.5477 133.8632
frequency: 64.5416 84.5123 133.8425 165.0857 203.0288 218.0326 260.1978 292.7078 446.5802 551.1848 582.0966 634.6260 659.6405 720.1413 797.0130 968.0738 978.7930 998.4060 1025.8099 1075.6985 1123.1751 1200.1732 1245.4387 1333.3074 1347.3746 1399.3478 1443.1136 1463.8877 1467.9176 1471.8699 1662.9585 3000.1833 3006.6663 3057.8122 3095.5406 3116.0469 3124.4100 3138.1516 3512.5971
redmass: 6.1816 3.8746 1.0781 3.3698 1.1977 3.2012 3.6203 3.6315 4.7307 2.5485 4.2979 1.4919 7.0960 4.8637 3.2454 1.1837 1.2064 1.8642 2.2677 1.5143 2.3423 1.2148 1.4775 1.6190 1.3098 1.2039 1.0530 1.0415 1.0529 1.0497 8.3521 1.0362 1.0287 1.0867 1.0984 1.1010 1.1044 1.1042 1.0639
irintensity: 0.7617 2.6835 0.2030 1.1009 1.2313 2.4382 1.9457 1.7460 22.9256 28.9289 13.0233 118.2870 2.1268 21.5726 2.2908 16.8885 5.4206 41.7372 179.2410 18.6374 38.1656 7.6230 1.9992 25.0517 7.0973 23.5464 10.4134 16.0602 14.7026 8.7583 252.8651 18.2321 26.2537 4.6702 17.3607 14.8803 15.7906 5.2168 23.1056
temp: 298.150 k
press: 1.00000 atm
elementType: 16 8 8 6 6 6 6 1 1 1 1 1 1 1 1
symmnumber: 1
zpe: 305466.3 jmol-1
zpe.correction: 0.116346 hartree
zpe.thermalcorrener: 0.125395 hartree
zpe.thermalcorrenthalpy: 0.126339 hartree
zpe.thermalcorrgfe: 0.082082 hartree
zpe.sumelectzpe: -705.166223 hartree
zpe.sumelectthermal: -705.157174 hartree
zpe.sumelectthermalent: -705.156230 hartree
zpe.sumelectthermalfe: -705.200487 hartree
dipole: 1.1543 -1.2785 2.0961
dipole: 2.7130
quadrupole: -51.5368 -44.2542 -51.7570
quadrupole: -0.6227 -2.2263 2.1380
quadrupole: -2.3542 4.9285 -2.5743 -0.6227 -2.2263 2.1380
hfenergy: -705.2825687 hartree
pointgroup: C01 [X(C4H8O2S1)]
dipole: 0.3870262 0.3936511 0.9135382 debye
dipolederiv: -0.2586533 -0.0519364 -0.0640742 -0.0562789 -0.1471445 0.1141717 0.0144588 0.0780767 -0.0482682 -0.3433862 0.0591506 0.0718646 0.0677772 -0.3556047 0.1685836 0.1044585 0.0920351 -1.1918634 -0.891447 -0.1035042 -0.2902553 -0.3341352 -0.3567449 -0.0667253 -0.1500398 0.0693653 -0.6738785 -0.0455375 -0.1543007 0.0975883 -0.137001 0.2513387 -0.0126 0.0931028 -0.0480606 -0.015237 -0.0253566 0.0497306 -0.0599855 0.0329283 -0.0122711 0.0886546 0.0135235 0.0046289 -0.0003154 1.2048036 0.2672768 0.173888 0.5387435 0.2154284 -0.143495 0.018769 -0.1502132 1.4125712 0.0463575 0.0509902 0.1043255 0.0635035 0.0168608 -0.0186266 0.078375 0.0028533 0.0909609 0.0233422 0.0052096 -0.0340974 0.0056458 -0.0191149 -0.0327012 -0.0240116 -0.0768812 -0.0443797 0.1097287 -0.0282726 -0.0372986 -0.037689 0.0166442 -0.1213713 -0.0350891 -0.0507985 0.0151562 -0.0406362 -0.1155754 0.0727217 -0.0786375 0.0522069 0.0351386 0.0359566 0.0462108 0.069625 -0.0194349 0.1425405 -0.0034579 0.126608 -0.0122006 0.0145779 0.0083783 0.0036828 0.0589394 -0.0112651 0.1191008 -0.0404599 0.1064062 0.0166041 0.003091 -0.0341555 0.0098422 0.0759367 0.0350389 -0.0500914 0.0667956 -0.055723 0.1035487 0.0160252 0.0271673 0.0488716 -0.0499915 0.0464271 -0.0598543 -0.0589249 -0.1031259 -0.0677563 -0.0730036 -0.0949622 -0.0376737 -0.0239238 0.1700189 -0.1304641 0.00137 -0.1390219 0.2982051 0.0282803 -0.0559317 0.0080606 0.324668 unknown
polarizability: 78.3501758|-6.4914909|54.5565416|6.8433381|-7.0475637|68.8204306 unknown
InChI: InChI=1S/C4H8O2S/c1-3(7-2)4(5)6/h3,5H,1-2H3
charge 0 multiplicity 1
15 atoms
S  1.810709 -0.336493 -0.634829
O  -0.74952 -0.100027 1.495907
O  -1.795074 -0.242133 -0.576318
C  0.385674 0.92461 -0.371923
C  0.122935 1.653987 -1.69447
C  -0.829618 0.153348 0.111174
C  2.457491 -0.475463 1.128799
H  0.728996 1.609221 0.421404
H  -0.191001 0.944185 -2.47805
H  1.033802 2.178113 -2.027519
H  -0.688855 2.39317 -1.569973
H  3.219431 -1.270683 1.112891
H  1.63452 -0.750958 1.804681
H  2.91607 0.474782 1.445509
H  -1.538759 -0.642958 1.768118
