program: Gaussian 09
title: 000100871
version: EM64L-G09RevD.01
frameworkgroup: C1[X(C10H22O5)]
method: RPBEPBE
basis: SDD
operation: Freq
keyword: #pfreq=noraman
keyword: PBEPBE/SDD
title: #p freq=noraman PBEPBE/SDD
converged: YES YES NO NO
title: Mulliken charges:
elementType: O O O O O C C C C C C C C C C H H H H H H H H H H H H H H H H H H H H H H
charge: -0.284721 -0.268984 -0.268330 -0.471054 -0.271116 -0.069065 -0.248774 -0.241217 -0.245146 -0.246300 -0.249384 -0.686489 -0.236460 -0.257005 -0.497368 0.198572 0.187837 0.211380 0.199359 0.180607 0.174393 0.206108 0.206618 0.174527 0.209207 0.172695 0.283403 0.186608 0.210249 0.212833 0.171026 0.177794 0.206101 0.339517 0.205008 0.198992 0.228580
chargesum: 0.00000
title: Mulliken charges with hydrogens summed into heavy atoms:
elementType: O O O O O C C C C C C C C C C
charge: -0.284721 -0.268984 -0.268330 -0.131537 -0.271116 0.129507 0.150443 0.138749 0.135356 0.134845 0.132518 -0.006229 0.147399 0.126890 0.135212
polarizability: 1.38511837e+02 1.12099831e+00 1.47546051e+02 9.47916671e-02 -2.44854800e-01 1.00562189e+02
1716.lowfreq: -17.7781 -9.4116 0.0003 0.0007 0.0008 4.1340 8.1260 10.6015 21.7408
frequency: -12.8589 8.4726 21.0225 37.1595 41.0925 53.2564 71.6333 96.8210 114.5366 134.1778 150.2137 174.0012 187.2787 201.5375 224.7027 239.1622 250.2321 270.9976 275.6111 299.1826 310.2365 352.3210 381.1476 424.5359 449.2324 488.6768 530.2093 554.1358 789.4369 795.7186 807.2234 820.2810 846.0329 914.2720 921.7553 927.8701 933.8238 994.6234 997.7113 1034.3388 1042.8798 1056.4039 1057.4938 1061.5695 1070.3321 1075.1747 1094.9185 1106.2277 1109.6384 1118.5221 1124.9264 1132.4431 1156.9763 1192.0201 1200.4048 1206.7823 1211.1324 1242.7969 1248.7597 1252.2838 1258.6272 1303.5136 1330.0217 1336.0319 1344.4067 1370.6812 1374.2147 1384.4640 1395.5258 1408.0993 1416.7414 1433.3946 1450.5292 1451.1641 1455.0808 1456.7506 1458.8490 1463.1487 1471.4580 1473.1776 1476.7735 1478.9778 1483.2149 2906.3367 2909.2939 2916.1557 2917.7923 2926.2462 2930.6371 2934.7360 2943.1635 2964.4608 2974.7165 2975.7572 2977.8230 2980.8501 2988.4441 2990.2475 2991.7779 2994.1850 3004.9494 3065.6115 3096.5146 3099.8081 3572.4733
redmass: 2.8525 4.5401 3.3852 5.4035 2.8703 4.0112 3.0101 2.9849 2.8409 3.5530 3.3333 5.1309 2.2629 2.1434 1.3624 1.1515 1.0955 2.4277 2.6527 2.6219 2.8569 2.6300 2.9893 2.5594 2.8112 2.6283 2.8522 2.9525 2.5350 2.5898 2.8184 2.9508 2.6269 1.4206 2.1557 2.0671 2.1051 2.7977 2.5991 2.5959 2.4811 1.6759 2.2371 3.4426 2.8136 3.1238 2.4032 3.4749 1.6874 2.2024 2.0284 1.7524 1.4277 1.1076 1.1801 1.1829 1.1694 1.1726 1.1497 1.1295 1.1223 1.1962 1.2401 1.2359 1.2791 1.2910 1.3544 1.3292 1.5042 1.5729 1.5847 1.1666 1.0835 1.0844 1.0542 1.0664 1.0771 1.0708 1.0879 1.0837 1.0744 1.0682 1.0810 1.0581 1.0582 1.0566 1.0419 1.0574 1.0575 1.0582 1.0568 1.0830 1.0390 1.1017 1.1015 1.1031 1.0985 1.1002 1.1025 1.1021 1.1071 1.0982 1.0984 1.0967 1.0662
irintensity: 0.7741 1.5552 0.5448 0.5205 1.3524 1.6675 10.4436 3.5547 2.5396 13.1591 5.1366 10.7024 2.9655 4.8374 8.5417 50.7198 92.4230 8.5348 2.1156 3.1775 4.5818 0.0238 6.8840 1.8419 7.5140 7.1489 0.7632 0.3962 5.8295 13.7256 13.7836 12.3103 7.3002 1.5528 7.4092 29.8814 53.5253 41.3682 35.6943 0.9893 14.3524 116.1942 4.9607 39.2469 133.6533 116.0275 48.4628 1.2781 20.4443 18.3771 38.4235 3.5235 4.0088 4.5281 8.5221 20.3737 17.5170 10.4578 1.9682 6.7301 10.2025 6.5638 3.4789 32.6242 16.3282 6.4813 6.8287 37.1796 1.5020 6.3606 5.0286 0.3457 12.3581 12.6474 17.9594 32.2221 1.9845 8.1486 3.8591 10.1417 14.4659 3.0069 5.3175 2.9746 9.2666 11.2001 80.4625 75.5160 211.1440 164.4587 80.4734 45.1604 29.8333 56.4530 39.9392 38.1939 142.4812 44.9725 36.5507 75.2929 62.9829 49.9869 10.9008 34.3204 3.5902
temp: 298.150 k
press: 1.00000 atm
elementType: 8 8 8 8 8 6 6 6 6 6 6 6 6 6 6 1 1 1 1 1 1 1 1 1 1 1 1 1 1 1 1 1 1 1 1 1 1
symmnumber: 1
zpe: 827954.5 jmol-1
zpe.correction: 0.315351 hartree
zpe.thermalcorrener: 0.334246 hartree
zpe.thermalcorrenthalpy: 0.335190 hartree
zpe.thermalcorrgfe: 0.264280 hartree
zpe.sumelectzpe: -769.013829 hartree
zpe.sumelectthermal: -768.994935 hartree
zpe.sumelectthermalent: -768.993990 hartree
zpe.sumelectthermalfe: -769.064901 hartree
dipole: 3.3428 -1.3889 0.6184
dipole: 3.6723
quadrupole: -86.6930 -74.2463 -93.1745
quadrupole: 8.0889 0.4021 3.3126
quadrupole: -1.9884 10.4583 -8.4699 8.0889 0.4021 3.3126
hfenergy: -769.3291804 hartree
pointgroup: C01 [X(C10H22O5)]
dipole: -1.408477 0.202129 0.2505599 debye
polarizability: 138.5284252|-1.195184|147.5271795|-0.3525207|0.1721526|100.5644716 unknown
InChI: InChI=1S/C10H22O5/c1-10(11)9-15-8-7-14-6-5-13-4-3-12-2/h10-11H,3-9H2,1-2H3
charge 0 multiplicity 1
37 atoms
O  2.383095 1.058707 0.515314
O  -0.141568 2.376263 -0.3077
O  -2.456242 0.445669 0.216399
O  4.023774 -2.094309 -0.342422
O  -2.048867 -2.562078 -0.209342
C  2.926889 -1.263349 0.209243
C  3.289078 0.166501 -0.212059
C  2.256971 2.393893 -0.065244
C  0.953101 2.993152 0.44481
C  -1.459622 2.654758 0.262986
C  -2.475788 1.759285 -0.433017
C  1.549278 -1.697333 -0.307993
C  -3.327832 -0.5160 -0.462607
C  -3.237451 -1.849135 0.265804
C  -1.82565 -3.8004 0.53014
H  2.944213 -1.310812 1.319047
H  3.157149 0.277978 -1.310187
H  4.34923 0.375792 0.042923
H  2.224462 2.340678 -1.174807
H  3.117225 3.033296 0.234459
H  0.952301 4.097501 0.297379
H  0.852709 2.779178 1.530766
H  -1.472171 2.440491 1.353467
H  -1.725878 3.72563 0.108643
H  -2.210355 1.673416 -1.508814
H  -3.49474 2.204278 -0.353635
H  0.770761 -0.985185 0.015961
H  1.271281 -2.698999 0.074046
H  1.54631 -1.733669 -1.413347
H  -3.018529 -0.652952 -1.521262
H  -4.380816 -0.149864 -0.446261
H  -4.147554 -2.457378 0.057491
H  -3.177545 -1.663982 1.36058
H  3.752686 -3.044806 -0.285874
H  -1.655631 -3.60593 1.610895
H  -2.682184 -4.50249 0.424856
H  -0.92449 -4.261494 0.095861
