program: Gaussian 09
title: 000100852
version: EM64L-G09RevD.01
frameworkgroup: C1[X(C11H15ClN2)]
method: RPBEPBE
basis: SDD
operation: Freq
keyword: #p
keyword: freq=noraman
keyword: PBEPBE/SDD
title: #p freq=noraman PBEPBE/SDD
converged: YES YES NO NO
title: Mulliken charges:
elementType: Cl N N C C C C C C C C C C C H H H H H H H H H H H H H H H
charge: -0.079448 -0.195428 -0.295675 -0.354057 -0.358912 -0.417492 -0.427829 0.282169 0.330750 -0.334031 -0.359741 -0.828198 -0.248063 -0.109410 0.220834 0.220431 0.224338 0.199434 0.189299 0.212160 0.212044 0.191754 0.271388 0.246749 0.254647 0.224608 0.247478 0.230126 0.250076
chargesum: 0.00000
title: Mulliken charges with hydrogens summed into heavy atoms:
elementType: Cl N N C C C C C C C C C C C
charge: -0.079448 -0.195428 -0.024288 0.087209 0.064860 -0.016033 -0.024031 0.282169 0.330750 -0.087282 -0.105094 -0.125986 0.002012 -0.109410
polarizability: 2.10662510e+02 2.03365267e+00 1.35944327e+02 2.14846433e-01 -3.31138201e+00 8.48282101e+01
1716.lowfreq: -8.1768 -0.0030 -0.0026 -0.0013 3.6646 11.2098 48.9356 79.0887 83.8110
frequency: 48.9263 79.0490 83.7979 164.0796 191.0126 209.7809 214.0092 245.8080 250.1238 280.5962 317.4399 363.8095 388.6874 410.8537 451.6552 459.5996 477.2795 516.8474 545.3302 551.7271 637.4951 680.9796 703.5685 717.7241 809.6586 833.1752 849.8553 867.8273 875.7522 921.1142 932.7506 939.2831 991.7116 1041.8544 1044.5029 1051.3409 1064.3711 1091.6382 1097.3122 1115.6973 1141.9367 1166.9480 1195.4162 1198.1609 1231.1067 1235.5734 1272.9600 1281.9394 1322.8027 1337.5278 1345.2046 1361.0606 1374.3734 1386.1961 1391.0535 1396.0064 1445.2523 1453.3792 1456.2569 1457.4322 1466.3701 1466.8765 1483.1923 1489.5588 1572.7425 1598.0836 2866.6878 2874.8553 2902.2088 2918.6757 2968.0645 3038.5644 3042.4853 3047.5936 3054.5203 3084.7462 3094.0180 3147.7529 3148.7435 3170.8729 3464.9872
redmass: 5.4456 3.5583 4.0404 5.6136 2.6582 1.4092 2.3263 7.0008 2.5777 2.0772 2.8593 4.2315 2.1819 5.6626 2.9241 2.9935 2.8608 2.1035 3.6276 3.5974 4.2401 1.8013 3.5037 3.5876 1.4796 4.6608 1.4986 3.5369 1.3387 1.9857 2.3377 1.7425 1.5237 1.8195 1.9540 1.7177 1.8006 1.9219 2.2280 2.4308 2.0503 3.3913 1.9720 1.1094 1.5066 1.5178 1.3715 1.2933 1.2530 1.3399 1.8453 2.8051 1.8815 1.4425 1.5031 2.3454 1.3418 1.0930 1.0875 1.1558 1.1083 1.0673 2.3566 1.1101 7.4245 6.3666 1.0709 1.0696 1.0683 1.0714 1.0392 1.0898 1.0910 1.0934 1.0914 1.0995 1.0892 1.0899 1.0896 1.0967 1.0754
irintensity: 0.0289 0.5352 0.6681 0.2772 3.0399 0.2796 2.4451 0.3561 6.8468 3.3569 4.6208 1.2129 8.3758 17.8837 6.0125 2.9729 17.0406 52.2313 3.1163 13.8721 48.9401 60.5748 2.9402 1.1832 43.0063 35.0018 0.8954 14.8941 15.6771 2.8989 8.7888 4.0198 10.4680 13.8851 25.7511 3.0955 3.9625 3.2890 26.6050 20.7509 34.7263 17.8849 34.7655 8.0840 81.4435 11.9499 4.8827 7.3427 34.7956 4.9373 17.0262 12.4041 16.4619 0.8641 21.5865 16.6719 2.2641 25.6989 7.1459 29.8344 8.2683 18.7403 123.1248 55.0641 0.7946 8.4479 75.5139 93.6016 79.0393 103.0653 34.4820 50.7909 55.0595 20.5368 29.5993 19.4945 14.0211 11.8674 1.6118 6.1396 1.0657
temp: 298.150 k
press: 1.00000 atm
elementType: 17 7 7 6 6 6 6 6 6 6 6 6 6 6 1 1 1 1 1 1 1 1 1 1 1 1 1 1 1
symmnumber: 1
zpe: 633244.5 jmol-1
zpe.correction: 0.241190 hartree
zpe.thermalcorrener: 0.254257 hartree
zpe.thermalcorrenthalpy: 0.255201 hartree
zpe.thermalcorrgfe: 0.201652 hartree
zpe.sumelectzpe: -996.655825 hartree
zpe.sumelectthermal: -996.642758 hartree
zpe.sumelectthermalent: -996.641814 hartree
zpe.sumelectthermalfe: -996.695364 hartree
dipole: 4.2660 0.5895 -0.4517
dipole: 4.3302
quadrupole: -94.1589 -82.6925 -93.9147
quadrupole: 0.7775 -2.4655 1.1235
quadrupole: -3.9035 7.5629 -3.6594 0.7775 -2.4655 1.1235
hfenergy: -996.8970154 hartree
pointgroup: C01 [X(C11H15Cl1N2)]
dipole: -1.6726522 0.3047538 0.1083347 debye
polarizability: 210.5445882|-3.4899296|134.3806904|0.858897|-9.713508|86.5097687 unknown
InChI: InChI=1S/C11H15ClN2/c1-9-8-10(12)2-3-11(9)14-6-4-13-5-7-14/h2-3,8,13H,4-7H2,1H3
charge 0 multiplicity 1
29 atoms
Cl 4.930502 -0.317358 0.026703
N  -1.151147 -0.06068 0.116386
N  -3.996719 -0.266427 -0.114198
C  -1.860866 0.449381 -1.089968
C  -1.878684 -1.196237 0.731113
C  -3.291484 0.882074 -0.721489
C  -3.31006 -0.758276 1.098935
C  0.276884 -0.122134 0.07377
C  1.048687 1.086848 -0.016359
C  0.960999 -1.367075 0.182926
C  2.461225 0.997043 -0.040231
C  0.396951 2.457933 -0.009463
C  2.369638 -1.443901 0.177494
C  3.10197 -0.252175 0.048737
H  -1.91675 -0.348368 -1.866357
H  -1.306729 1.299262 -1.516449
H  -1.343667 -1.511534 1.644347
H  -1.946775 -2.067727 0.037638
H  -3.223315 1.762369 -0.034393
H  -3.827941 1.19424 -1.636184
H  -3.862958 -1.626935 1.501348
H  -3.23929 0.016205 1.90245
H  -4.997832 -0.090774 0.034308
H  0.388861 -2.296943 0.255321
H  3.058453 1.913105 -0.097481
H  0.150633 2.816143 -1.028637
H  -0.543654 2.431992 0.56957
H  1.071697 3.206244 0.441029
H  2.87837 -2.409094 0.256734
