program: Gaussian 09
title: 000100845
version: EM64L-G09RevD.01
frameworkgroup: C1[X(C11H20O)]
method: RPBEPBE
basis: SDD
operation: Freq
keyword: #pfreq=noraman
keyword: PBEPBE/SDD
title: #p freq=noraman PBEPBE/SDD
converged: YES YES NO NO
title: Mulliken charges:
elementType: O C C C C C C C C C C C H H H H H H H H H H H H H H H H H H H H
charge: -0.194938 0.013125 -0.414628 -0.390597 -0.469934 -0.746607 -0.459318 -0.299272 0.371932 -0.069839 -0.785389 -0.789800 0.203469 0.198176 0.194502 0.205244 0.216611 0.206645 0.203033 0.215201 0.220041 0.208460 0.236351 0.230322 0.208780 0.166695 0.216393 0.225858 0.215598 0.221753 0.218220 0.223913
chargesum: 0.00000
title: Mulliken charges with hydrogens summed into heavy atoms:
elementType: O C C C C C C C C C C C
charge: -0.194938 0.216594 -0.021949 0.031259 -0.060256 -0.102905 0.007354 -0.090493 0.371932 0.096856 -0.127540 -0.125914
polarizability: 1.47027538e+02 2.98687929e+00 1.13502998e+02 1.06070177e+01 -1.74812280e+00 1.05240018e+02
1716.lowfreq: -5.0975 -0.0007 -0.0005 -0.0004 2.0878 7.1707 15.7695 25.8912 35.8652
frequency: 13.9608 25.6887 35.7383 60.1197 103.0921 130.6991 134.6514 158.2791 160.7563 180.0029 199.6868 226.6792 248.2958 306.0786 336.1386 365.7394 390.2848 426.6790 441.3851 488.6657 521.3560 654.7352 668.7506 755.0173 783.7501 814.2877 849.0096 871.6651 891.4335 920.1515 946.1957 953.5720 971.6923 994.9460 998.1599 1028.7774 1063.5456 1081.1920 1094.3413 1106.3772 1130.7421 1143.7770 1158.9524 1179.9003 1227.6187 1238.6353 1258.0990 1277.7775 1308.2232 1311.6463 1327.7871 1349.7698 1359.0169 1360.2031 1379.6767 1386.2325 1388.0723 1397.9770 1423.0813 1454.6981 1455.7412 1461.0646 1464.6670 1467.8943 1472.0341 1474.7402 1477.9315 1488.8602 1644.9245 1695.0975 2844.1570 2946.3924 2949.0028 2955.3697 2956.2411 2963.0028 2965.3462 2971.4103 2983.4244 2987.5598 3010.3086 3027.1661 3030.7602 3043.0435 3043.8476 3060.7674 3063.2837 3075.8594 3077.7764 3093.4764
redmass: 3.5359 4.2514 3.1076 2.9591 2.6540 1.1336 2.5345 1.7346 1.8790 1.4353 1.8210 1.9412 1.8857 2.0606 2.6885 2.2303 2.3673 2.2403 2.4416 2.3842 2.8998 1.4438 2.4262 2.0771 2.4830 1.3525 1.4381 1.6828 2.5430 1.7571 1.3741 1.7504 1.5035 1.2542 1.9083 2.0162 1.9063 1.6658 1.9144 2.2661 2.2221 1.9129 1.3677 1.6149 1.5628 1.6632 1.4043 1.1845 1.3331 1.2577 1.4404 1.4940 1.4654 1.5229 1.2256 1.2363 1.2878 1.2303 1.1028 1.0628 1.0662 1.0789 1.0813 1.0603 1.0509 1.0790 1.0600 1.0546 7.4116 6.5087 1.0837 1.0626 1.0651 1.0782 1.0380 1.0414 1.0602 1.0387 1.0706 1.0846 1.1002 1.0970 1.0964 1.0986 1.0926 1.0917 1.0984 1.0981 1.0973 1.0954
irintensity: 0.4457 6.4492 1.8634 0.1380 1.6168 0.7235 5.1611 1.7354 1.0568 1.2376 2.1514 0.5110 0.2270 0.4900 1.6128 2.9536 2.9991 2.5984 4.9623 2.9024 0.4248 7.9341 9.2940 4.9431 2.2215 16.9638 7.5111 3.0270 14.3575 2.7305 0.7153 0.3357 0.3852 4.8606 0.7532 3.3394 6.4395 3.8200 12.7054 1.6498 5.2834 14.1982 1.0684 4.1775 2.4483 4.2586 26.8391 1.8276 1.5212 1.0423 15.8157 2.6045 1.4184 4.8909 9.5056 1.0795 41.0857 10.6523 31.9382 6.3188 3.8744 3.2338 8.1891 14.6265 17.8318 12.6704 23.4773 9.1098 129.6277 3.4720 165.0271 20.7273 31.4568 16.6304 35.8781 78.9799 39.9517 22.6183 20.9438 18.9302 38.7986 5.0640 53.1345 19.6384 17.9127 45.0812 55.3597 39.1600 61.0111 38.1500
temp: 298.150 k
press: 1.00000 atm
elementType: 8 6 6 6 6 6 6 6 6 6 6 6 1 1 1 1 1 1 1 1 1 1 1 1 1 1 1 1 1 1 1 1
symmnumber: 1
zpe: 739379.6 jmol-1
zpe.correction: 0.281615 hartree
zpe.thermalcorrener: 0.297239 hartree
zpe.thermalcorrenthalpy: 0.298183 hartree
zpe.thermalcorrgfe: 0.236265 hartree
zpe.sumelectzpe: -505.384995 hartree
zpe.sumelectthermal: -505.369371 hartree
zpe.sumelectthermalent: -505.368427 hartree
zpe.sumelectthermalfe: -505.430346 hartree
dipole: -2.9037 -1.3409 0.8255
dipole: 3.3032
quadrupole: -95.0664 -71.9909 -75.4323
quadrupole: -5.2173 7.4463 0.1677
quadrupole: -14.2365 8.8390 5.3975 -5.2173 7.4463 0.1677
hfenergy: -505.6666102 hartree
pointgroup: C01 [X(C11H20O1)]
dipole: 1.1425216 0.5349078 0.3120604 debye
polarizability: 146.5986081|3.4733461|113.524919|-11.2762387|1.684111|105.6470269 unknown
InChI: InChI=1S/C11H20O/c1-10(2)6-4-7-11(3)8-5-9-12/h6,9,11H,4-5,7-8H2,1-3H3
charge 0 multiplicity 1
32 atoms
O  -4.91138 0.289321 -0.463817
C  -0.58578 -0.727478 -0.207554
C  -0.033579 -0.659948 1.242691
C  -2.127082 -0.540345 -0.245389
C  1.518026 -0.668957 1.357371
C  -0.206457 -2.059954 -0.897295
C  -2.604784 0.855663 0.19603
C  2.162455 0.549921 0.725685
C  3.163828 0.60249 -0.2003
C  -4.089001 1.111899 0.006144
C  3.686163 1.938536 -0.708012
C  3.851405 -0.610982 -0.802525
H  -0.121568 0.101472 -0.784632
H  -0.443877 -1.515006 1.820485
H  -0.405206 0.2608 1.737769
H  -2.61234 -1.310838 0.38676
H  -2.492677 -0.723743 -1.274263
H  1.922621 -1.603764 0.930209
H  1.774787 -0.690575 2.438132
H  -0.610958 -2.100855 -1.925749
H  0.888213 -2.191088 -0.965638
H  -0.619688 -2.922314 -0.338391
H  -2.379014 1.05525 1.265833
H  -2.062698 1.654404 -0.358494
H  1.755372 1.511444 1.081851
H  -4.428744 2.1338 0.324961
H  4.769732 2.047551 -0.501066
H  3.161575 2.789693 -0.239717
H  3.565657 2.021664 -1.806966
H  4.933694 -0.603645 -0.563288
H  3.773339 -0.594643 -1.907985
H  3.435065 -1.566875 -0.445539
